[midPoint-ci] Build failed in Jenkins: midPoint - master - main - PG 16 #423
Jenkins
noreply at evolveum.com
Sun Mar 30 04:13:01 CEST 2025
See <https://jenkins.evolveum.com/job/midpoint-master-main/423/display/redirect>
Changes:
------------------------------------------
[...truncated 3551 lines...]
[INFO] --- maven-enforcer-plugin:3.5.0:enforce (enforce) @ ucf-impl-builtin ---
[INFO] Rule 1: org.apache.maven.enforcer.rules.dependency.DependencyConvergence passed
[INFO] Rule 2: org.apache.maven.enforcer.rules.dependency.BannedDependencies passed
[INFO]
[INFO] --- maven-checkstyle-plugin:3.1.2:check (validate) @ ucf-impl-builtin ---
[INFO] Starting audit...
Audit done.
[INFO] You have 0 Checkstyle violations.
[INFO]
[INFO] --- gitdescribe-maven-plugin:3.0:gitdescribe (git-describe) @ ucf-impl-builtin ---
[INFO]
[INFO] <<< maven-source-plugin:3.1.0:jar (attach-sources) < generate-sources @ ucf-impl-builtin <<<
[INFO]
[INFO]
[INFO] --- maven-source-plugin:3.1.0:jar (attach-sources) @ ucf-impl-builtin ---
[INFO] Building jar: /home/jenkins/agent/workspace/midpoint-master-main/provisioning/ucf-impl-builtin/target/ucf-impl-builtin-4.10-SNAPSHOT-sources.jar
[INFO]
[INFO] --- cyclonedx-maven-plugin:2.9.1:makeBom (sbom-package) @ ucf-impl-builtin ---
[INFO] CycloneDX: Resolving Dependencies
[WARNING] com.evolveum.prism:prism-parent:4.10-SNAPSHOT/maven-metadata.xmlfailed to transfer from http://0.0.0.0/ during a previous attempt. This failure was cached in the local repository and resolution will not be reattempted until the update interval of maven-default-http-blocker has elapsed or updates are forced. Original error: Could not transfer metadata com.evolveum.prism:prism-parent:4.10-SNAPSHOT/maven-metadata.xml from/to maven-default-http-blocker (http://0.0.0.0/): transfer failed for http://0.0.0.0/com/evolveum/prism/prism-parent/4.10-SNAPSHOT/maven-metadata.xml
[WARNING] com.evolveum.prism:prism-parent:4.10-SNAPSHOT/maven-metadata.xmlfailed to transfer from https://snapshots.terracotta.org/ during a previous attempt. This failure was cached in the local repository and resolution will not be reattempted until the update interval of terracotta-snapshots has elapsed or updates are forced. Original error: Could not transfer metadata com.evolveum.prism:prism-parent:4.10-SNAPSHOT/maven-metadata.xml from/to terracotta-snapshots (https://snapshots.terracotta.org/): authorization failed for https://snapshots.terracotta.org/com/evolveum/prism/prism-parent/4.10-SNAPSHOT/maven-metadata.xml, status: 403 Forbidden
[WARNING] com.evolveum.prism:prism:4.10-SNAPSHOT/maven-metadata.xmlfailed to transfer from http://0.0.0.0/ during a previous attempt. This failure was cached in the local repository and resolution will not be reattempted until the update interval of maven-default-http-blocker has elapsed or updates are forced. Original error: Could not transfer metadata com.evolveum.prism:prism:4.10-SNAPSHOT/maven-metadata.xml from/to maven-default-http-blocker (http://0.0.0.0/): transfer failed for http://0.0.0.0/com/evolveum/prism/prism/4.10-SNAPSHOT/maven-metadata.xml
[WARNING] com.evolveum.prism:prism:4.10-SNAPSHOT/maven-metadata.xmlfailed to transfer from https://snapshots.terracotta.org/ during a previous attempt. This failure was cached in the local repository and resolution will not be reattempted until the update interval of terracotta-snapshots has elapsed or updates are forced. Original error: Could not transfer metadata com.evolveum.prism:prism:4.10-SNAPSHOT/maven-metadata.xml from/to terracotta-snapshots (https://snapshots.terracotta.org/): authorization failed for https://snapshots.terracotta.org/com/evolveum/prism/prism/4.10-SNAPSHOT/maven-metadata.xml, status: 403 Forbidden
[WARNING] com.evolveum.prism:prism-parent:4.10-SNAPSHOT/maven-metadata.xmlfailed to transfer from http://0.0.0.0/ during a previous attempt. This failure was cached in the local repository and resolution will not be reattempted until the update interval of maven-default-http-blocker has elapsed or updates are forced. Original error: Could not transfer metadata com.evolveum.prism:prism-parent:4.10-SNAPSHOT/maven-metadata.xml from/to maven-default-http-blocker (http://0.0.0.0/): transfer failed for http://0.0.0.0/com/evolveum/prism/prism-parent/4.10-SNAPSHOT/maven-metadata.xml
[WARNING] com.evolveum.prism:prism-parent:4.10-SNAPSHOT/maven-metadata.xmlfailed to transfer from https://snapshots.terracotta.org/ during a previous attempt. This failure was cached in the local repository and resolution will not be reattempted until the update interval of terracotta-snapshots has elapsed or updates are forced. Original error: Could not transfer metadata com.evolveum.prism:prism-parent:4.10-SNAPSHOT/maven-metadata.xml from/to terracotta-snapshots (https://snapshots.terracotta.org/): authorization failed for https://snapshots.terracotta.org/com/evolveum/prism/prism-parent/4.10-SNAPSHOT/maven-metadata.xml, status: 403 Forbidden
[WARNING] com.evolveum.prism:prism-parent:4.10-SNAPSHOT/maven-metadata.xmlfailed to transfer from http://0.0.0.0/ during a previous attempt. This failure was cached in the local repository and resolution will not be reattempted until the update interval of maven-default-http-blocker has elapsed or updates are forced. Original error: Could not transfer metadata com.evolveum.prism:prism-parent:4.10-SNAPSHOT/maven-metadata.xml from/to maven-default-http-blocker (http://0.0.0.0/): transfer failed for http://0.0.0.0/com/evolveum/prism/prism-parent/4.10-SNAPSHOT/maven-metadata.xml
[WARNING] com.evolveum.prism:prism-parent:4.10-SNAPSHOT/maven-metadata.xmlfailed to transfer from https://snapshots.terracotta.org/ during a previous attempt. This failure was cached in the local repository and resolution will not be reattempted until the update interval of terracotta-snapshots has elapsed or updates are forced. Original error: Could not transfer metadata com.evolveum.prism:prism-parent:4.10-SNAPSHOT/maven-metadata.xml from/to terracotta-snapshots (https://snapshots.terracotta.org/): authorization failed for https://snapshots.terracotta.org/com/evolveum/prism/prism-parent/4.10-SNAPSHOT/maven-metadata.xml, status: 403 Forbidden
[WARNING] com.evolveum.prism:prism:4.10-SNAPSHOT/maven-metadata.xmlfailed to transfer from http://0.0.0.0/ during a previous attempt. This failure was cached in the local repository and resolution will not be reattempted until the update interval of maven-default-http-blocker has elapsed or updates are forced. Original error: Could not transfer metadata com.evolveum.prism:prism:4.10-SNAPSHOT/maven-metadata.xml from/to maven-default-http-blocker (http://0.0.0.0/): transfer failed for http://0.0.0.0/com/evolveum/prism/prism/4.10-SNAPSHOT/maven-metadata.xml
[WARNING] com.evolveum.prism:prism:4.10-SNAPSHOT/maven-metadata.xmlfailed to transfer from https://snapshots.terracotta.org/ during a previous attempt. This failure was cached in the local repository and resolution will not be reattempted until the update interval of terracotta-snapshots has elapsed or updates are forced. Original error: Could not transfer metadata com.evolveum.prism:prism:4.10-SNAPSHOT/maven-metadata.xml from/to terracotta-snapshots (https://snapshots.terracotta.org/): authorization failed for https://snapshots.terracotta.org/com/evolveum/prism/prism/4.10-SNAPSHOT/maven-metadata.xml, status: 403 Forbidden
[WARNING] com.evolveum.prism.tools:tools:4.10-SNAPSHOT/maven-metadata.xmlfailed to transfer from https://snapshots.terracotta.org/ during a previous attempt. This failure was cached in the local repository and resolution will not be reattempted until the update interval of terracotta-snapshots has elapsed or updates are forced. Original error: Could not transfer metadata com.evolveum.prism.tools:tools:4.10-SNAPSHOT/maven-metadata.xml from/to terracotta-snapshots (https://snapshots.terracotta.org/): authorization failed for https://snapshots.terracotta.org/com/evolveum/prism/tools/tools/4.10-SNAPSHOT/maven-metadata.xml, status: 403 Forbidden
[WARNING] com.evolveum.prism.tools:tools:4.10-SNAPSHOT/maven-metadata.xmlfailed to transfer from http://0.0.0.0/ during a previous attempt. This failure was cached in the local repository and resolution will not be reattempted until the update interval of maven-default-http-blocker has elapsed or updates are forced. Original error: Could not transfer metadata com.evolveum.prism.tools:tools:4.10-SNAPSHOT/maven-metadata.xml from/to maven-default-http-blocker (http://0.0.0.0/): transfer failed for http://0.0.0.0/com/evolveum/prism/tools/tools/4.10-SNAPSHOT/maven-metadata.xml
[WARNING] com.evolveum.prism:prism-parent:4.10-SNAPSHOT/maven-metadata.xmlfailed to transfer from https://snapshots.terracotta.org/ during a previous attempt. This failure was cached in the local repository and resolution will not be reattempted until the update interval of terracotta-snapshots has elapsed or updates are forced. Original error: Could not transfer metadata com.evolveum.prism:prism-parent:4.10-SNAPSHOT/maven-metadata.xml from/to terracotta-snapshots (https://snapshots.terracotta.org/): authorization failed for https://snapshots.terracotta.org/com/evolveum/prism/prism-parent/4.10-SNAPSHOT/maven-metadata.xml, status: 403 Forbidden
[WARNING] com.evolveum.prism:prism-parent:4.10-SNAPSHOT/maven-metadata.xmlfailed to transfer from http://0.0.0.0/ during a previous attempt. This failure was cached in the local repository and resolution will not be reattempted until the update interval of maven-default-http-blocker has elapsed or updates are forced. Original error: Could not transfer metadata com.evolveum.prism:prism-parent:4.10-SNAPSHOT/maven-metadata.xml from/to maven-default-http-blocker (http://0.0.0.0/): transfer failed for http://0.0.0.0/com/evolveum/prism/prism-parent/4.10-SNAPSHOT/maven-metadata.xml
[INFO] CycloneDX: Creating BOM version 1.6 with 96 component(s)
[INFO] CycloneDX: Writing and validating BOM (XML): /home/jenkins/agent/workspace/midpoint-master-main/provisioning/ucf-impl-builtin/target/bom.xml
[INFO] attaching as ucf-impl-builtin-4.10-SNAPSHOT-cyclonedx.xml
[INFO] CycloneDX: Writing and validating BOM (JSON): /home/jenkins/agent/workspace/midpoint-master-main/provisioning/ucf-impl-builtin/target/bom.json
[INFO] attaching as ucf-impl-builtin-4.10-SNAPSHOT-cyclonedx.json
[INFO]
[INFO] --- maven-dependency-plugin:3.3.0:analyze-only (analyze) @ ucf-impl-builtin ---
[INFO] No dependency problems found
[INFO]
[INFO] --- maven-install-plugin:3.1.4:install (default-install) @ ucf-impl-builtin ---
[INFO] Installing /home/jenkins/agent/workspace/midpoint-master-main/provisioning/ucf-impl-builtin/pom.xml to /root/.m2/repository/com/evolveum/midpoint/provisioning/ucf-impl-builtin/4.10-SNAPSHOT/ucf-impl-builtin-4.10-SNAPSHOT.pom
[INFO] Installing /home/jenkins/agent/workspace/midpoint-master-main/provisioning/ucf-impl-builtin/target/ucf-impl-builtin-4.10-SNAPSHOT.jar to /root/.m2/repository/com/evolveum/midpoint/provisioning/ucf-impl-builtin/4.10-SNAPSHOT/ucf-impl-builtin-4.10-SNAPSHOT.jar
[INFO] Installing /home/jenkins/agent/workspace/midpoint-master-main/provisioning/ucf-impl-builtin/target/ucf-impl-builtin-4.10-SNAPSHOT-sources.jar to /root/.m2/repository/com/evolveum/midpoint/provisioning/ucf-impl-builtin/4.10-SNAPSHOT/ucf-impl-builtin-4.10-SNAPSHOT-sources.jar
[INFO] Installing /home/jenkins/agent/workspace/midpoint-master-main/provisioning/ucf-impl-builtin/target/bom.xml to /root/.m2/repository/com/evolveum/midpoint/provisioning/ucf-impl-builtin/4.10-SNAPSHOT/ucf-impl-builtin-4.10-SNAPSHOT-cyclonedx.xml
[INFO] Installing /home/jenkins/agent/workspace/midpoint-master-main/provisioning/ucf-impl-builtin/target/bom.json to /root/.m2/repository/com/evolveum/midpoint/provisioning/ucf-impl-builtin/4.10-SNAPSHOT/ucf-impl-builtin-4.10-SNAPSHOT-cyclonedx.json
[INFO]
[INFO] --- maven-deploy-plugin:2.8.2:deploy (default-deploy) @ ucf-impl-builtin ---
[INFO] Deploying com.evolveum.midpoint.provisioning:ucf-impl-builtin:4.10-SNAPSHOT at end
[INFO]
[INFO] --------< com.evolveum.midpoint.provisioning:provisioning-impl >--------
[INFO] Building midPoint Provisioning - impl 4.10-SNAPSHOT [36/68]
[INFO] --------------------------------[ jar ]---------------------------------
[INFO]
[INFO] --- maven-clean-plugin:3.4.1:clean (default-clean) @ provisioning-impl ---
[INFO]
[INFO] --- maven-enforcer-plugin:3.5.0:enforce (enforce) @ provisioning-impl ---
[INFO] Rule 1: org.apache.maven.enforcer.rules.dependency.DependencyConvergence passed
[INFO] Rule 2: org.apache.maven.enforcer.rules.dependency.BannedDependencies passed
[INFO]
[INFO] --- maven-checkstyle-plugin:3.1.2:check (validate) @ provisioning-impl ---
[INFO] Starting audit...
Audit done.
[INFO] You have 0 Checkstyle violations.
[INFO]
[INFO] --- gitdescribe-maven-plugin:3.0:gitdescribe (git-describe) @ provisioning-impl ---
[INFO] Setting Git Describe: v4.10devel-1275-ga1458a66255
[INFO]
[INFO] --- maven-resources-plugin:3.1.0:resources (default-resources) @ provisioning-impl ---
[INFO] Using 'UTF-8' encoding to copy filtered resources.
[INFO] Copying 1 resource
[INFO]
[INFO] --- maven-compiler-plugin:3.11.0:compile (default-compile) @ provisioning-impl ---
[INFO] Changes detected - recompiling the module! :dependency
[INFO] Compiling 165 source files with javac [debug target 17] to target/classes
[INFO] /home/jenkins/agent/workspace/midpoint-master-main/provisioning/provisioning-impl/src/main/java/com/evolveum/midpoint/provisioning/impl/ProvisioningServiceImpl.java: Some input files use or override a deprecated API.
[INFO] /home/jenkins/agent/workspace/midpoint-master-main/provisioning/provisioning-impl/src/main/java/com/evolveum/midpoint/provisioning/impl/ProvisioningServiceImpl.java: Recompile with -Xlint:deprecation for details.
[INFO] /home/jenkins/agent/workspace/midpoint-master-main/provisioning/provisioning-impl/src/main/java/com/evolveum/midpoint/provisioning/impl/resourceobjects/EntitlementConverter.java: Some input files use unchecked or unsafe operations.
[INFO] /home/jenkins/agent/workspace/midpoint-master-main/provisioning/provisioning-impl/src/main/java/com/evolveum/midpoint/provisioning/impl/resourceobjects/EntitlementConverter.java: Recompile with -Xlint:unchecked for details.
[INFO]
[INFO] --- maven-resources-plugin:3.1.0:testResources (default-testResources) @ provisioning-impl ---
[INFO] Using 'UTF-8' encoding to copy filtered resources.
[INFO] Copying 195 resources
[INFO]
[INFO] --- maven-compiler-plugin:3.11.0:testCompile (default-testCompile) @ provisioning-impl ---
[INFO] Changes detected - recompiling the module! :dependency
[INFO] Compiling 92 source files with javac [debug target 17] to target/test-classes
[WARNING] /home/jenkins/agent/workspace/midpoint-master-main/provisioning/provisioning-impl/src/test/java/com/evolveum/midpoint/provisioning/impl/dummy/TestDummy.java:[3820,134] non-varargs call of varargs method with inexact argument type for last parameter;
cast to java.lang.Object for a varargs call
cast to java.lang.Object[] for a non-varargs call and to suppress this warning
[WARNING] /home/jenkins/agent/workspace/midpoint-master-main/provisioning/provisioning-impl/src/test/java/com/evolveum/midpoint/provisioning/impl/async/update/TestAsyncUpdateNoCaching.java:[81,66] non-varargs call of varargs method with inexact argument type for last parameter;
cast to java.lang.Object for a varargs call
cast to java.lang.Object[] for a non-varargs call and to suppress this warning
[INFO] /home/jenkins/agent/workspace/midpoint-master-main/provisioning/provisioning-impl/src/test/java/com/evolveum/midpoint/provisioning/impl/dummy/AbstractDummyTest.java: Some input files use or override a deprecated API.
[INFO] /home/jenkins/agent/workspace/midpoint-master-main/provisioning/provisioning-impl/src/test/java/com/evolveum/midpoint/provisioning/impl/dummy/AbstractDummyTest.java: Recompile with -Xlint:deprecation for details.
[INFO] /home/jenkins/agent/workspace/midpoint-master-main/provisioning/provisioning-impl/src/test/java/com/evolveum/midpoint/provisioning/impl/dummy/AbstractDummyTest.java: Some input files use unchecked or unsafe operations.
[INFO] /home/jenkins/agent/workspace/midpoint-master-main/provisioning/provisioning-impl/src/test/java/com/evolveum/midpoint/provisioning/impl/dummy/AbstractDummyTest.java: Recompile with -Xlint:unchecked for details.
[INFO]
[INFO] --- maven-surefire-plugin:3.1.2:test (default-test) @ provisioning-impl ---
[INFO] Tests are skipped.
[INFO]
[INFO] --- maven-jar-plugin:3.4.2:jar (default-jar) @ provisioning-impl ---
[INFO] Building jar: /home/jenkins/agent/workspace/midpoint-master-main/provisioning/provisioning-impl/target/provisioning-impl-4.10-SNAPSHOT.jar
[INFO]
[INFO] >>> maven-source-plugin:3.1.0:jar (attach-sources) > generate-sources @ provisioning-impl >>>
[INFO]
[INFO] --- maven-enforcer-plugin:3.5.0:enforce (enforce) @ provisioning-impl ---
[INFO] Rule 1: org.apache.maven.enforcer.rules.dependency.DependencyConvergence passed
[INFO] Rule 2: org.apache.maven.enforcer.rules.dependency.BannedDependencies passed
[INFO]
[INFO] --- maven-checkstyle-plugin:3.1.2:check (validate) @ provisioning-impl ---
[INFO] Starting audit...
Audit done.
[INFO] You have 0 Checkstyle violations.
[INFO]
[INFO] --- gitdescribe-maven-plugin:3.0:gitdescribe (git-describe) @ provisioning-impl ---
[INFO]
[INFO] <<< maven-source-plugin:3.1.0:jar (attach-sources) < generate-sources @ provisioning-impl <<<
[INFO]
[INFO]
[INFO] --- maven-source-plugin:3.1.0:jar (attach-sources) @ provisioning-impl ---
[INFO] Building jar: /home/jenkins/agent/workspace/midpoint-master-main/provisioning/provisioning-impl/target/provisioning-impl-4.10-SNAPSHOT-sources.jar
[INFO]
[INFO] --- cyclonedx-maven-plugin:2.9.1:makeBom (sbom-package) @ provisioning-impl ---
[INFO] CycloneDX: Resolving Dependencies
[WARNING] com.evolveum.prism:prism-parent:4.10-SNAPSHOT/maven-metadata.xmlfailed to transfer from http://0.0.0.0/ during a previous attempt. This failure was cached in the local repository and resolution will not be reattempted until the update interval of maven-default-http-blocker has elapsed or updates are forced. Original error: Could not transfer metadata com.evolveum.prism:prism-parent:4.10-SNAPSHOT/maven-metadata.xml from/to maven-default-http-blocker (http://0.0.0.0/): transfer failed for http://0.0.0.0/com/evolveum/prism/prism-parent/4.10-SNAPSHOT/maven-metadata.xml
[WARNING] com.evolveum.prism:prism-parent:4.10-SNAPSHOT/maven-metadata.xmlfailed to transfer from https://snapshots.terracotta.org/ during a previous attempt. This failure was cached in the local repository and resolution will not be reattempted until the update interval of terracotta-snapshots has elapsed or updates are forced. Original error: Could not transfer metadata com.evolveum.prism:prism-parent:4.10-SNAPSHOT/maven-metadata.xml from/to terracotta-snapshots (https://snapshots.terracotta.org/): authorization failed for https://snapshots.terracotta.org/com/evolveum/prism/prism-parent/4.10-SNAPSHOT/maven-metadata.xml, status: 403 Forbidden
[WARNING] com.evolveum.prism:prism:4.10-SNAPSHOT/maven-metadata.xmlfailed to transfer from http://0.0.0.0/ during a previous attempt. This failure was cached in the local repository and resolution will not be reattempted until the update interval of maven-default-http-blocker has elapsed or updates are forced. Original error: Could not transfer metadata com.evolveum.prism:prism:4.10-SNAPSHOT/maven-metadata.xml from/to maven-default-http-blocker (http://0.0.0.0/): transfer failed for http://0.0.0.0/com/evolveum/prism/prism/4.10-SNAPSHOT/maven-metadata.xml
[WARNING] com.evolveum.prism:prism:4.10-SNAPSHOT/maven-metadata.xmlfailed to transfer from https://snapshots.terracotta.org/ during a previous attempt. This failure was cached in the local repository and resolution will not be reattempted until the update interval of terracotta-snapshots has elapsed or updates are forced. Original error: Could not transfer metadata com.evolveum.prism:prism:4.10-SNAPSHOT/maven-metadata.xml from/to terracotta-snapshots (https://snapshots.terracotta.org/): authorization failed for https://snapshots.terracotta.org/com/evolveum/prism/prism/4.10-SNAPSHOT/maven-metadata.xml, status: 403 Forbidden
[WARNING] com.evolveum.prism:prism-parent:4.10-SNAPSHOT/maven-metadata.xmlfailed to transfer from http://0.0.0.0/ during a previous attempt. This failure was cached in the local repository and resolution will not be reattempted until the update interval of maven-default-http-blocker has elapsed or updates are forced. Original error: Could not transfer metadata com.evolveum.prism:prism-parent:4.10-SNAPSHOT/maven-metadata.xml from/to maven-default-http-blocker (http://0.0.0.0/): transfer failed for http://0.0.0.0/com/evolveum/prism/prism-parent/4.10-SNAPSHOT/maven-metadata.xml
[WARNING] com.evolveum.prism:prism-parent:4.10-SNAPSHOT/maven-metadata.xmlfailed to transfer from https://snapshots.terracotta.org/ during a previous attempt. This failure was cached in the local repository and resolution will not be reattempted until the update interval of terracotta-snapshots has elapsed or updates are forced. Original error: Could not transfer metadata com.evolveum.prism:prism-parent:4.10-SNAPSHOT/maven-metadata.xml from/to terracotta-snapshots (https://snapshots.terracotta.org/): authorization failed for https://snapshots.terracotta.org/com/evolveum/prism/prism-parent/4.10-SNAPSHOT/maven-metadata.xml, status: 403 Forbidden
[WARNING] com.evolveum.prism.tools:tools:4.10-SNAPSHOT/maven-metadata.xmlfailed to transfer from https://snapshots.terracotta.org/ during a previous attempt. This failure was cached in the local repository and resolution will not be reattempted until the update interval of terracotta-snapshots has elapsed or updates are forced. Original error: Could not transfer metadata com.evolveum.prism.tools:tools:4.10-SNAPSHOT/maven-metadata.xml from/to terracotta-snapshots (https://snapshots.terracotta.org/): authorization failed for https://snapshots.terracotta.org/com/evolveum/prism/tools/tools/4.10-SNAPSHOT/maven-metadata.xml, status: 403 Forbidden
[WARNING] com.evolveum.prism.tools:tools:4.10-SNAPSHOT/maven-metadata.xmlfailed to transfer from http://0.0.0.0/ during a previous attempt. This failure was cached in the local repository and resolution will not be reattempted until the update interval of maven-default-http-blocker has elapsed or updates are forced. Original error: Could not transfer metadata com.evolveum.prism.tools:tools:4.10-SNAPSHOT/maven-metadata.xml from/to maven-default-http-blocker (http://0.0.0.0/): transfer failed for http://0.0.0.0/com/evolveum/prism/tools/tools/4.10-SNAPSHOT/maven-metadata.xml
[WARNING] com.evolveum.prism:prism-parent:4.10-SNAPSHOT/maven-metadata.xmlfailed to transfer from https://snapshots.terracotta.org/ during a previous attempt. This failure was cached in the local repository and resolution will not be reattempted until the update interval of terracotta-snapshots has elapsed or updates are forced. Original error: Could not transfer metadata com.evolveum.prism:prism-parent:4.10-SNAPSHOT/maven-metadata.xml from/to terracotta-snapshots (https://snapshots.terracotta.org/): authorization failed for https://snapshots.terracotta.org/com/evolveum/prism/prism-parent/4.10-SNAPSHOT/maven-metadata.xml, status: 403 Forbidden
[WARNING] com.evolveum.prism:prism-parent:4.10-SNAPSHOT/maven-metadata.xmlfailed to transfer from http://0.0.0.0/ during a previous attempt. This failure was cached in the local repository and resolution will not be reattempted until the update interval of maven-default-http-blocker has elapsed or updates are forced. Original error: Could not transfer metadata com.evolveum.prism:prism-parent:4.10-SNAPSHOT/maven-metadata.xml from/to maven-default-http-blocker (http://0.0.0.0/): transfer failed for http://0.0.0.0/com/evolveum/prism/prism-parent/4.10-SNAPSHOT/maven-metadata.xml
[INFO] CycloneDX: Creating BOM version 1.6 with 85 component(s)
[INFO] CycloneDX: Writing and validating BOM (XML): /home/jenkins/agent/workspace/midpoint-master-main/provisioning/provisioning-impl/target/bom.xml
[INFO] attaching as provisioning-impl-4.10-SNAPSHOT-cyclonedx.xml
[INFO] CycloneDX: Writing and validating BOM (JSON): /home/jenkins/agent/workspace/midpoint-master-main/provisioning/provisioning-impl/target/bom.json
[INFO] attaching as provisioning-impl-4.10-SNAPSHOT-cyclonedx.json
[INFO]
[INFO] --- maven-failsafe-plugin:3.1.2:integration-test (integration-test) @ provisioning-impl ---
[INFO] Tests are skipped.
[INFO]
[INFO] --- maven-failsafe-plugin:3.1.2:verify (integration-test) @ provisioning-impl ---
[INFO] Tests are skipped.
[INFO]
[INFO] --- maven-dependency-plugin:3.3.0:analyze-only (analyze) @ provisioning-impl ---
[WARNING] Used undeclared dependencies found:
[WARNING] com.evolveum.axiom:axiom:jar:4.10-SNAPSHOT:compile
[WARNING] Non-test scoped test only dependencies found:
[WARNING] com.evolveum.axiom:axiom:jar:4.10-SNAPSHOT:compile
[INFO] ------------------------------------------------------------------------
[INFO] Reactor Summary for midPoint Project 4.10-SNAPSHOT:
[INFO]
[INFO] midPoint Project ................................... SUCCESS [ 21.741 s]
[INFO] midPoint Infrastructure ............................ SUCCESS [ 0.383 s]
[INFO] midPoint Infrastructure - schema ................... SUCCESS [01:44 min]
[INFO] midPoint Repository ................................ SUCCESS [ 0.195 s]
[INFO] midPoint Repository - api .......................... SUCCESS [ 2.240 s]
[INFO] midPoint Task Manager - api ........................ SUCCESS [ 2.898 s]
[INFO] midPoint Infrastructure - testing utils (lvl 2) .... SUCCESS [ 7.866 s]
[INFO] midPoint Infrastructure - common ................... SUCCESS [ 5.499 s]
[INFO] midPoint Audit - api ............................... SUCCESS [ 2.308 s]
[INFO] midPoint Security - api ............................ SUCCESS [ 2.614 s]
[INFO] midPoint Repository - SQL common support ........... SUCCESS [ 3.167 s]
[INFO] midPoint Repository - sql repository ............... SUCCESS [ 8.165 s]
[INFO] midPoint System Initialization ..................... SUCCESS [ 28.523 s]
[INFO] midPoint Repository - new SQL repository ........... SUCCESS [ 12.833 s]
[INFO] midPoint Repository - sql repository test .......... SUCCESS [ 8.384 s]
[INFO] midPoint Repository Cache .......................... SUCCESS [ 6.902 s]
[INFO] midPoint Audit - logging impl ...................... SUCCESS [ 2.221 s]
[INFO] midPoint Icf Connectors ............................ SUCCESS [ 0.208 s]
[INFO] Dummy Resource ..................................... SUCCESS [ 3.864 s]
[INFO] midPoint Repository - test utils ................... SUCCESS [ 7.988 s]
[INFO] midPoint Security - impl ........................... SUCCESS [ 6.038 s]
[INFO] midPoint Task Manager - Quartz impl ................ SUCCESS [ 8.407 s]
[INFO] midPoint Tools ..................................... SUCCESS [ 0.167 s]
[INFO] midPoint Tools - Ninja ............................. SUCCESS [ 18.748 s]
[INFO] midPoint Tools - custom Spring Boot JAR layout ..... SUCCESS [ 0.526 s]
[INFO] midPoint Infrastructure - pure JAXB schema ......... SUCCESS [ 11.186 s]
[INFO] midPoint Repo Commons .............................. SUCCESS [ 10.181 s]
[INFO] midPoint Security Enforcer - api ................... SUCCESS [ 2.176 s]
[INFO] midPoint Security Enforcer - impl .................. SUCCESS [ 3.127 s]
[INFO] midPoint Provisioning .............................. SUCCESS [ 0.200 s]
[INFO] midPoint Provisioning - api ........................ SUCCESS [ 2.603 s]
[INFO] Unified Connector Framework - api .................. SUCCESS [ 2.649 s]
[INFO] Dummy Connector .................................... SUCCESS [ 1.355 s]
[INFO] Unified Connector Framework - ConnId impl .......... SUCCESS [ 8.610 s]
[INFO] Unified Connector Framework - Built-in impl ........ SUCCESS [ 8.187 s]
[INFO] midPoint Provisioning - impl ....................... FAILURE [ 12.764 s]
[INFO] midPoint Model ..................................... SKIPPED
[INFO] midPoint Model - api ............................... SKIPPED
[INFO] midPoint Model - common ............................ SKIPPED
[INFO] midPoint Notifications - api ....................... SKIPPED
[INFO] Dummy Connector Fake ............................... SKIPPED
[INFO] midPoint Authentication - api ...................... SKIPPED
[INFO] midPoint Model - test .............................. SKIPPED
[INFO] midPoint Report - api .............................. SKIPPED
[INFO] midPoint Cases - api ............................... SKIPPED
[INFO] midPoint Access Certification - api ................ SKIPPED
[INFO] midPoint Model - impl .............................. SKIPPED
[INFO] midPoint Notifications - impl ...................... SKIPPED
[INFO] midPoint Report - impl ............................. SKIPPED
[INFO] midPoint Model - integration tests ................. SKIPPED
[INFO] midPoint Workflow - api ............................ SKIPPED
[INFO] midPoint Cases - impl .............................. SKIPPED
[INFO] midPoint Workflow - impl ........................... SKIPPED
[INFO] midPoint Access Certification - impl ............... SKIPPED
[INFO] midPoint Authentication - impl ..................... SKIPPED
[INFO] midPoint REST-ish service implementation ........... SKIPPED
[INFO] midPoint Customizations ............................ SKIPPED
[INFO] midPoint User Interface ............................ SKIPPED
[INFO] midPoint User Interface - admin web gui ............ SKIPPED
[INFO] midPoint Spring Boot JAR ........................... SKIPPED
[INFO] midPoint Testing Infrastructure .................... SKIPPED
[INFO] midPoint Testing - Resource Connection Tests ....... SKIPPED
[INFO] midPoint Testing - Long Tests ...................... SKIPPED
[INFO] midPoint Testing - Story Tests ..................... SKIPPED
[INFO] midPoint Testing - REST API ........................ SKIPPED
[INFO] midPoint Distribution .............................. SKIPPED
[INFO] midPoint API Distribution .......................... SKIPPED
[INFO] midPoint JavaDoc ................................... SKIPPED
[INFO] ------------------------------------------------------------------------
[INFO] BUILD FAILURE
[INFO] ------------------------------------------------------------------------
[INFO] Total time: 05:32 min
[INFO] Finished at: 2025-03-30T02:13:00Z
[INFO] ------------------------------------------------------------------------
[ERROR] Failed to execute goal org.apache.maven.plugins:maven-dependency-plugin:3.3.0:analyze-only (analyze) on project provisioning-impl: Dependency problems found -> [Help 1]
[ERROR]
[ERROR] To see the full stack trace of the errors, re-run Maven with the -e switch.
[ERROR] Re-run Maven using the -X switch to enable full debug logging.
[ERROR]
[ERROR] For more information about the errors and possible solutions, please read the following articles:
[ERROR] [Help 1] http://cwiki.apache.org/confluence/display/MAVEN/MojoExecutionException
[ERROR]
[ERROR] After correcting the problems, you can resume the build with the command
[ERROR] mvn <args> -rf :provisioning-impl
[Pipeline] }
[Pipeline] // withCredentials
[Pipeline] }
[Pipeline] // container
[Pipeline] }
[Pipeline] // stage
[Pipeline] error
[Pipeline] step
More information about the midPoint-ci
mailing list