[midPoint-ci] Build failed in Jenkins: midPoint - master - main - PG 16 #415

Jenkins noreply at evolveum.com
Wed Mar 26 12:24:03 CET 2025


See <https://jenkins.evolveum.com/job/midpoint-master-main/415/display/redirect>

Changes:


------------------------------------------
[...truncated 7272 lines...]
[WARNING] /home/jenkins/agent/workspace/midpoint-master-main/dist/javadoc/target/distro-javadoc-sources/prism-api-4.10-20250325.132852-85-sources/com/evolveum/midpoint/prism/schema/PrismSchema.java:50: warning: invalid input: '&'
[WARNING] /** Just a convenience method. Useful for diagnostics & tests. */
[WARNING] ^
[WARNING] /home/jenkins/agent/workspace/midpoint-master-main/repo/repo-sqale/src/main/java/com/evolveum/midpoint/repo/sqale/qmodel/org/QOrgClosure.java:25: warning: Tag @link: reference not found: SqaleRepositoryService#isAnySubordinate(java.lang.String, java.util.Collection)
[WARNING] * {@link SqaleRepositoryService#isAnySubordinate(java.lang.String, java.util.Collection)}.
[WARNING] ^
[WARNING] /home/jenkins/agent/workspace/midpoint-master-main/repo/repo-sqale/src/main/java/com/evolveum/midpoint/repo/sqale/mapping/RefTableTargetResolver.java:26: warning: invalid input: '<'
[WARNING] * `<a:objectReferenceTargetType>` element for the reference, using more generic type means
[WARNING] ^
[WARNING] /home/jenkins/agent/workspace/midpoint-master-main/repo/repo-api/src/main/java/com/evolveum/midpoint/repo/api/RepositoryService.java:583: warning: invalid input: '<'
[WARNING] * </p
[WARNING] ^
[WARNING] /home/jenkins/agent/workspace/midpoint-master-main/infra/schema/src/main/java/com/evolveum/midpoint/schema/processor/ResourceObjectIdentification.java:39: warning: invalid input: '<'
[WARNING] * additional `<?>` in the code. To be reconsidered.
[WARNING] ^
[WARNING] /home/jenkins/agent/workspace/midpoint-master-main/dist/javadoc/target/distro-javadoc-sources/prism-api-4.10-20250325.132852-85-sources/com/evolveum/midpoint/prism/schemaContext/SchemaContextDefinition.java:29: warning: Tag @link: reference not found: ResourceObjectContextResolver
[WARNING] * For example {@link ResourceObjectContextResolver}
[WARNING] ^
[WARNING] /home/jenkins/agent/workspace/midpoint-master-main/dist/javadoc/target/distro-javadoc-sources/prism-api-4.10-20250325.132852-85-sources/com/evolveum/midpoint/prism/schemaContext/SchemaContextDefinition.java:29: warning: Tag @link: reference not found: ResourceObjectContextResolver
[WARNING] * For example {@link ResourceObjectContextResolver}
[WARNING] ^
[WARNING] /home/jenkins/agent/workspace/midpoint-master-main/gui/admin-gui/src/main/java/com/evolveum/midpoint/web/page/self/component/SecurityQuestionsPanel.java:208: warning: Tag @author cannot be used in method documentation.  It can only be used in the following types of documentation: overview, module, package, class/interface.
[WARNING] * @author oguzhan
[WARNING] ^
[WARNING] /home/jenkins/agent/workspace/midpoint-master-main/gui/admin-gui/src/main/java/com/evolveum/midpoint/web/page/self/component/SecurityQuestionsPanel.java:225: warning: Tag @author cannot be used in method documentation.  It can only be used in the following types of documentation: overview, module, package, class/interface.
[WARNING] * @author oguzhan
[WARNING] ^
[WARNING] /home/jenkins/agent/workspace/midpoint-master-main/infra/schema/src/main/java/com/evolveum/midpoint/schema/util/ShadowAssociationsUtil.java:82: warning: Tag @see: reference not found: #createValueFromDefaultObject(AbstractShadow)
[WARNING] * @see #createValueFromDefaultObject(AbstractShadow)
[WARNING] ^
[WARNING] /home/jenkins/agent/workspace/midpoint-master-main/infra/schema/src/main/java/com/evolveum/midpoint/schema/processor/ShadowAssociationValue.java:416: warning: invalid input: '&'
[WARNING] * I am not sure if the current mode selection (literal DOM & operational data) is 100% correct.
[WARNING] ^
[WARNING] /home/jenkins/agent/workspace/midpoint-master-main/repo/repo-sqale/src/main/java/com/evolveum/midpoint/repo/sqale/qmodel/shadow/ShadowReferenceAttributesUpdateContext.java:23: warning: @param argument "<S>" is not the name of a type parameter.
[WARNING] * @param <S> schema type of the container mapped by the nested mapping
[WARNING] ^
[WARNING] /home/jenkins/agent/workspace/midpoint-master-main/repo/repo-sqale/src/main/java/com/evolveum/midpoint/repo/sqale/qmodel/shadow/ShadowReferenceAttributesUpdateContext.java:24: warning: @param argument "<Q>" is not the name of a type parameter.
[WARNING] * @param <Q> entity query type that holds the data for the mapped attributes
[WARNING] ^
[WARNING] /home/jenkins/agent/workspace/midpoint-master-main/repo/repo-sqale/src/main/java/com/evolveum/midpoint/repo/sqale/qmodel/shadow/ShadowReferenceAttributesUpdateContext.java:25: warning: @param argument "<R>" is not the name of a type parameter.
[WARNING] * @param <R> row type related to the {@link Q}
[WARNING] ^
[WARNING] /home/jenkins/agent/workspace/midpoint-master-main/repo/repo-sqale/src/main/java/com/evolveum/midpoint/repo/sqale/qmodel/shadow/ShadowReferenceAttributesUpdateContext.java:25: warning: Tag @link: reference not found: Q
[WARNING] * @param <R> row type related to the {@link Q}
[WARNING] ^
[WARNING] /home/jenkins/agent/workspace/midpoint-master-main/repo/repo-sqlbase/src/main/java/com/evolveum/midpoint/repo/sqlbase/mapping/SqlDetailFetchMapper.java:32: warning: Tag @link: reference not found: #execute(SqlRepoContext, Supplier, R)
[WARNING] * To load the details for one master entity use {@link #execute(SqlRepoContext, Supplier, R)}.
[WARNING] ^
[WARNING] /home/jenkins/agent/workspace/midpoint-master-main/repo/repo-common/src/main/java/com/evolveum/midpoint/repo/common/subscription/SubscriptionState.java:255: warning: invalid input: '<'
[WARNING] /** The subscription ID is OK, and the declared time has not passed. E.g. for 0524, the time is <= May 31th, 2024. */
[WARNING] ^
[WARNING] /home/jenkins/agent/workspace/midpoint-master-main/provisioning/provisioning-api/src/main/java/com/evolveum/midpoint/provisioning/api/SynchronizationEvent.java:41: warning: Tag @link: reference not found: ProvisioningService#synchronize(com.evolveum.midpoint.schema.ResourceShadowCoordinates, LiveSyncOptions,
[WARNING] * ({@link ProvisioningService#synchronize(com.evolveum.midpoint.schema.ResourceShadowCoordinates, LiveSyncOptions,
[WARNING] ^
[WARNING] LiveSyncTokenStorage, LiveSyncEventHandler, Task, OperationResult)
[WARNING] /home/jenkins/agent/workspace/midpoint-master-main/provisioning/provisioning-api/src/main/java/com/evolveum/midpoint/provisioning/api/SynchronizationEvent.java:43: warning: Tag @link: reference not found: ProvisioningService#processAsynchronousUpdates(com.evolveum.midpoint.schema.ResourceShadowCoordinates,
[WARNING] * or {@link ProvisioningService#processAsynchronousUpdates(com.evolveum.midpoint.schema.ResourceShadowCoordinates,
[WARNING] ^
[WARNING] AsyncUpdateEventHandler, Task, OperationResult)
[WARNING] /home/jenkins/agent/workspace/midpoint-master-main/model/model-impl/src/main/java/com/evolveum/midpoint/model/impl/sync/tasks/SyncTaskHelper.java:60: warning: Tag @link: reference not found: SearchBasedActivityRunSpecifics#customizeQuery(ObjectQuery, OperationResult)
[WARNING] *     (like selecting only shadows that were not updated for given time - see {@link
[WARNING] ^
[WARNING] /home/jenkins/agent/workspace/midpoint-master-main/model/authentication-api/src/main/java/com/evolveum/midpoint/authentication/api/authorization/Url.java:26: warning: Tag @link: reference not found: com.evolveum.midpoint.authentication.impl.authorization.MidPointGuiAuthorizationEvaluator
[WARNING] * Url that will be matched in {@link com.evolveum.midpoint.authentication.impl.authorization.MidPointGuiAuthorizationEvaluator}
[WARNING] ^
[WARNING] /home/jenkins/agent/workspace/midpoint-master-main/model/authentication-api/src/main/java/com/evolveum/midpoint/authentication/api/authorization/Url.java:26: warning: Tag @link: reference not found: com.evolveum.midpoint.authentication.impl.authorization.MidPointGuiAuthorizationEvaluator
[WARNING] * Url that will be matched in {@link com.evolveum.midpoint.authentication.impl.authorization.MidPointGuiAuthorizationEvaluator}
[WARNING] ^
[WARNING] /home/jenkins/agent/workspace/midpoint-master-main/dist/javadoc/target/distro-javadoc-sources/prism-api-4.10-20250325.132852-85-sources/com/evolveum/midpoint/prism/query/ValueFilter.java:137: warning: @param argument "potential" is not a parameter name.
[WARNING] * @param potential exists path
[WARNING] ^
[WARNING] /home/jenkins/agent/workspace/midpoint-master-main/dist/javadoc/target/distro-javadoc-sources/prism-api-4.10-20250325.132852-85-sources/com/evolveum/midpoint/prism/Item.java:241: warning: invalid input: '<'
[WARNING] * FIXME and maybe we should return List<? extends V> to avoid specializing the values, see ShadowAssociationValue in midPoint
[WARNING] ^
[WARNING] /home/jenkins/agent/workspace/midpoint-master-main/provisioning/provisioning-api/src/main/java/com/evolveum/midpoint/provisioning/api/LiveSyncEventHandler.java:16: warning: Tag @link: reference not found: ProvisioningService#synchronize(ResourceShadowCoordinates, LiveSyncOptions,
[WARNING] * Handles changes retrieved by {@link ProvisioningService#synchronize(ResourceShadowCoordinates, LiveSyncOptions,
[WARNING] ^
[WARNING] LiveSyncTokenStorage, LiveSyncEventHandler, Task, OperationResult)
[WARNING] /home/jenkins/agent/workspace/midpoint-master-main/repo/task-api/src/main/java/com/evolveum/midpoint/task/api/ExpressionEnvironment.java:13: warning: Tag @link: reference not found: Expression
[WARNING] * Describes an environment in which an {@link Expression} is evaluated.
[WARNING] ^
[WARNING] /home/jenkins/agent/workspace/midpoint-master-main/gui/admin-gui/src/main/java/com/evolveum/midpoint/web/session/ResourcesStorage.java:38: warning: Tag @link: reference not found: com.evolveum.midpoint.web.page.admin.resources.content.PageContentAccounts
[WARNING] * Paging DTO used in table on page {@link com.evolveum.midpoint.web.page.admin.resources.content.PageContentAccounts}
[WARNING] ^
[WARNING] /home/jenkins/agent/workspace/midpoint-master-main/gui/admin-gui/src/main/java/com/evolveum/midpoint/web/session/ResourcesStorage.java:31: warning: Tag @link: reference not found: com.evolveum.midpoint.web.page.admin.resources.content.PageContentAccounts
[WARNING] * DTO used for search in {@link com.evolveum.midpoint.web.page.admin.resources.content.PageContentAccounts}
[WARNING] ^
[WARNING] /home/jenkins/agent/workspace/midpoint-master-main/provisioning/provisioning-api/src/main/java/com/evolveum/midpoint/provisioning/api/LiveSyncEventHandler.java:16: warning: Tag @link: reference not found: ProvisioningService#synchronize(ResourceShadowCoordinates, LiveSyncOptions,
[WARNING] * Handles changes retrieved by {@link ProvisioningService#synchronize(ResourceShadowCoordinates, LiveSyncOptions,
[WARNING] ^
[WARNING] LiveSyncTokenStorage, LiveSyncEventHandler, Task, OperationResult)
[WARNING] /home/jenkins/agent/workspace/midpoint-master-main/provisioning/provisioning-api/src/main/java/com/evolveum/midpoint/provisioning/api/LiveSyncEventHandler.java:16: warning: Tag @link: reference not found: ProvisioningService#synchronize(ResourceShadowCoordinates, LiveSyncOptions,
[WARNING] * Handles changes retrieved by {@link ProvisioningService#synchronize(ResourceShadowCoordinates, LiveSyncOptions,
[WARNING] ^
[WARNING] LiveSyncTokenStorage, LiveSyncEventHandler, Task, OperationResult)
[WARNING] /home/jenkins/agent/workspace/midpoint-master-main/provisioning/provisioning-api/src/main/java/com/evolveum/midpoint/provisioning/api/LiveSyncEventHandler.java:16: warning: Tag @link: reference not found: ProvisioningService#synchronize(ResourceShadowCoordinates, LiveSyncOptions,
[WARNING] * Handles changes retrieved by {@link ProvisioningService#synchronize(ResourceShadowCoordinates, LiveSyncOptions,
[WARNING] ^
[WARNING] LiveSyncTokenStorage, LiveSyncEventHandler, Task, OperationResult)
[WARNING] /home/jenkins/agent/workspace/midpoint-master-main/repo/task-api/src/main/java/com/evolveum/midpoint/task/api/ExpressionEnvironment.java:13: warning: Tag @link: reference not found: Expression
[WARNING] * Describes an environment in which an {@link Expression} is evaluated.
[WARNING] ^
[WARNING] /home/jenkins/agent/workspace/midpoint-master-main/repo/task-api/src/main/java/com/evolveum/midpoint/task/api/ExpressionEnvironment.java:13: warning: Tag @link: reference not found: Expression
[WARNING] * Describes an environment in which an {@link Expression} is evaluated.
[WARNING] ^
[WARNING] /home/jenkins/agent/workspace/midpoint-master-main/repo/task-api/src/main/java/com/evolveum/midpoint/task/api/ExpressionEnvironment.java:13: warning: Tag @link: reference not found: Expression
[WARNING] * Describes an environment in which an {@link Expression} is evaluated.
[WARNING] ^
[WARNING] /home/jenkins/agent/workspace/midpoint-master-main/repo/task-api/src/main/java/com/evolveum/midpoint/task/api/ExpressionEnvironment.java:13: warning: Tag @link: reference not found: Expression
[WARNING] * Describes an environment in which an {@link Expression} is evaluated.
[WARNING] ^
[WARNING] /home/jenkins/agent/workspace/midpoint-master-main/provisioning/provisioning-api/src/main/java/com/evolveum/midpoint/provisioning/api/LiveSyncEventHandler.java:16: warning: Tag @link: reference not found: ProvisioningService#synchronize(ResourceShadowCoordinates, LiveSyncOptions,
[WARNING] * Handles changes retrieved by {@link ProvisioningService#synchronize(ResourceShadowCoordinates, LiveSyncOptions,
[WARNING] ^
[WARNING] LiveSyncTokenStorage, LiveSyncEventHandler, Task, OperationResult)
[WARNING] /home/jenkins/agent/workspace/midpoint-master-main/infra/schema/src/main/java/com/evolveum/midpoint/schema/config/ConfigurationItemable.java:110: warning: Tag link: reference not accessible: com.evolveum.midpoint.schema.config.ConfigurationItemable
[WARNING] /** As {@link #configCheck(boolean, String, Object...)}, but checks that the value is not null. */
[WARNING] ^
[WARNING] /home/jenkins/agent/workspace/midpoint-master-main/repo/task-api/src/main/java/com/evolveum/midpoint/task/api/ExpressionEnvironment.java:13: warning: Tag @link: reference not found: Expression
[WARNING] * Describes an environment in which an {@link Expression} is evaluated.
[WARNING] ^
[WARNING] /home/jenkins/agent/workspace/midpoint-master-main/provisioning/provisioning-api/src/main/java/com/evolveum/midpoint/provisioning/api/LiveSyncEventHandler.java:16: warning: Tag @link: reference not found: ProvisioningService#synchronize(ResourceShadowCoordinates, LiveSyncOptions,
[WARNING] * Handles changes retrieved by {@link ProvisioningService#synchronize(ResourceShadowCoordinates, LiveSyncOptions,
[WARNING] ^
[WARNING] LiveSyncTokenStorage, LiveSyncEventHandler, Task, OperationResult)
[WARNING] /home/jenkins/agent/workspace/midpoint-master-main/model/authentication-api/src/main/java/com/evolveum/midpoint/authentication/api/authorization/Url.java:26: warning: Tag @link: reference not found: com.evolveum.midpoint.authentication.impl.authorization.MidPointGuiAuthorizationEvaluator
[WARNING] * Url that will be matched in {@link com.evolveum.midpoint.authentication.impl.authorization.MidPointGuiAuthorizationEvaluator}
[WARNING] ^
[WARNING] 77 warnings
[INFO] Building jar: /home/jenkins/agent/workspace/midpoint-master-main/dist/javadoc/target/javadoc-4.10-SNAPSHOT-javadoc.jar
[INFO] 
[INFO] --- cyclonedx-maven-plugin:2.9.1:makeBom (sbom-package) @ javadoc ---
[INFO] CycloneDX: Resolving Dependencies
[WARNING] com.evolveum.chartjs:wicket-chartjs:0.6-SNAPSHOT/maven-metadata.xmlfailed to transfer from https://snapshots.terracotta.org/ during a previous attempt. This failure was cached in the local repository and resolution will not be reattempted until the update interval of terracotta-snapshots has elapsed or updates are forced. Original error: Could not transfer metadata com.evolveum.chartjs:wicket-chartjs:0.6-SNAPSHOT/maven-metadata.xml from/to terracotta-snapshots (https://snapshots.terracotta.org/): authorization failed for https://snapshots.terracotta.org/com/evolveum/chartjs/wicket-chartjs/0.6-SNAPSHOT/maven-metadata.xml, status: 403 Forbidden
[WARNING] com.evolveum.chartjs:wicket-chartjs:0.6-SNAPSHOT/maven-metadata.xmlfailed to transfer from http://0.0.0.0/ during a previous attempt. This failure was cached in the local repository and resolution will not be reattempted until the update interval of maven-default-http-blocker has elapsed or updates are forced. Original error: Could not transfer metadata com.evolveum.chartjs:wicket-chartjs:0.6-SNAPSHOT/maven-metadata.xml from/to maven-default-http-blocker (http://0.0.0.0/): transfer failed for http://0.0.0.0/com/evolveum/chartjs/wicket-chartjs/0.6-SNAPSHOT/maven-metadata.xml
[WARNING] com.evolveum.prism:prism-parent:4.10-SNAPSHOT/maven-metadata.xmlfailed to transfer from http://0.0.0.0/ during a previous attempt. This failure was cached in the local repository and resolution will not be reattempted until the update interval of maven-default-http-blocker has elapsed or updates are forced. Original error: Could not transfer metadata com.evolveum.prism:prism-parent:4.10-SNAPSHOT/maven-metadata.xml from/to maven-default-http-blocker (http://0.0.0.0/): transfer failed for http://0.0.0.0/com/evolveum/prism/prism-parent/4.10-SNAPSHOT/maven-metadata.xml
[WARNING] com.evolveum.prism:prism-parent:4.10-SNAPSHOT/maven-metadata.xmlfailed to transfer from https://snapshots.terracotta.org/ during a previous attempt. This failure was cached in the local repository and resolution will not be reattempted until the update interval of terracotta-snapshots has elapsed or updates are forced. Original error: Could not transfer metadata com.evolveum.prism:prism-parent:4.10-SNAPSHOT/maven-metadata.xml from/to terracotta-snapshots (https://snapshots.terracotta.org/): authorization failed for https://snapshots.terracotta.org/com/evolveum/prism/prism-parent/4.10-SNAPSHOT/maven-metadata.xml, status: 403 Forbidden
[WARNING] com.evolveum.prism.tools:tools:4.10-SNAPSHOT/maven-metadata.xmlfailed to transfer from http://0.0.0.0/ during a previous attempt. This failure was cached in the local repository and resolution will not be reattempted until the update interval of maven-default-http-blocker has elapsed or updates are forced. Original error: Could not transfer metadata com.evolveum.prism.tools:tools:4.10-SNAPSHOT/maven-metadata.xml from/to maven-default-http-blocker (http://0.0.0.0/): transfer failed for http://0.0.0.0/com/evolveum/prism/tools/tools/4.10-SNAPSHOT/maven-metadata.xml
[WARNING] com.evolveum.prism.tools:tools:4.10-SNAPSHOT/maven-metadata.xmlfailed to transfer from https://snapshots.terracotta.org/ during a previous attempt. This failure was cached in the local repository and resolution will not be reattempted until the update interval of terracotta-snapshots has elapsed or updates are forced. Original error: Could not transfer metadata com.evolveum.prism.tools:tools:4.10-SNAPSHOT/maven-metadata.xml from/to terracotta-snapshots (https://snapshots.terracotta.org/): authorization failed for https://snapshots.terracotta.org/com/evolveum/prism/tools/tools/4.10-SNAPSHOT/maven-metadata.xml, status: 403 Forbidden
[WARNING] com.evolveum.prism:prism-parent:4.10-SNAPSHOT/maven-metadata.xmlfailed to transfer from http://0.0.0.0/ during a previous attempt. This failure was cached in the local repository and resolution will not be reattempted until the update interval of maven-default-http-blocker has elapsed or updates are forced. Original error: Could not transfer metadata com.evolveum.prism:prism-parent:4.10-SNAPSHOT/maven-metadata.xml from/to maven-default-http-blocker (http://0.0.0.0/): transfer failed for http://0.0.0.0/com/evolveum/prism/prism-parent/4.10-SNAPSHOT/maven-metadata.xml
[WARNING] com.evolveum.prism:prism-parent:4.10-SNAPSHOT/maven-metadata.xmlfailed to transfer from https://snapshots.terracotta.org/ during a previous attempt. This failure was cached in the local repository and resolution will not be reattempted until the update interval of terracotta-snapshots has elapsed or updates are forced. Original error: Could not transfer metadata com.evolveum.prism:prism-parent:4.10-SNAPSHOT/maven-metadata.xml from/to terracotta-snapshots (https://snapshots.terracotta.org/): authorization failed for https://snapshots.terracotta.org/com/evolveum/prism/prism-parent/4.10-SNAPSHOT/maven-metadata.xml, status: 403 Forbidden
[INFO] CycloneDX: Creating BOM version 1.6 with 319 component(s)
[INFO] CycloneDX: Writing and validating BOM (XML): /home/jenkins/agent/workspace/midpoint-master-main/dist/javadoc/target/bom.xml
[INFO]            attaching as javadoc-4.10-SNAPSHOT-cyclonedx.xml
[INFO] CycloneDX: Writing and validating BOM (JSON): /home/jenkins/agent/workspace/midpoint-master-main/dist/javadoc/target/bom.json
[INFO]            attaching as javadoc-4.10-SNAPSHOT-cyclonedx.json
[INFO] 
[INFO] --- maven-dependency-plugin:3.3.0:analyze-only (analyze) @ javadoc ---
[INFO] Skipping plugin execution
[INFO] 
[INFO] --- maven-install-plugin:3.1.4:install (default-install) @ javadoc ---
[INFO] Skipping artifact installation
[INFO] 
[INFO] --- maven-deploy-plugin:2.8.2:deploy (default-deploy) @ javadoc ---
[INFO] ------------------------------------------------------------------------
[INFO] Reactor Summary for midPoint Project 4.10-SNAPSHOT:
[INFO] 
[INFO] midPoint Project ................................... SUCCESS [ 23.923 s]
[INFO] midPoint Infrastructure ............................ SUCCESS [  0.405 s]
[INFO] midPoint Infrastructure - schema ................... SUCCESS [01:46 min]
[INFO] midPoint Repository ................................ SUCCESS [  0.224 s]
[INFO] midPoint Repository - api .......................... SUCCESS [  2.184 s]
[INFO] midPoint Task Manager - api ........................ SUCCESS [  2.829 s]
[INFO] midPoint Infrastructure - testing utils (lvl 2) .... SUCCESS [ 10.317 s]
[INFO] midPoint Infrastructure - common ................... SUCCESS [  5.504 s]
[INFO] midPoint Audit - api ............................... SUCCESS [  2.236 s]
[INFO] midPoint Security - api ............................ SUCCESS [  2.455 s]
[INFO] midPoint Repository - SQL common support ........... SUCCESS [  3.253 s]
[INFO] midPoint Repository - sql repository ............... SUCCESS [  8.958 s]
[INFO] midPoint System Initialization ..................... SUCCESS [ 28.868 s]
[INFO] midPoint Repository - new SQL repository ........... SUCCESS [ 13.320 s]
[INFO] midPoint Repository - sql repository test .......... SUCCESS [  8.870 s]
[INFO] midPoint Repository Cache .......................... SUCCESS [  7.057 s]
[INFO] midPoint Audit - logging impl ...................... SUCCESS [  2.147 s]
[INFO] midPoint Icf Connectors ............................ SUCCESS [  0.224 s]
[INFO] Dummy Resource ..................................... SUCCESS [  3.625 s]
[INFO] midPoint Repository - test utils ................... SUCCESS [  8.514 s]
[INFO] midPoint Security - impl ........................... SUCCESS [  6.022 s]
[INFO] midPoint Task Manager - Quartz impl ................ SUCCESS [  8.810 s]
[INFO] midPoint Tools ..................................... SUCCESS [  0.189 s]
[INFO] midPoint Tools - Ninja ............................. SUCCESS [ 18.545 s]
[INFO] midPoint Tools - custom Spring Boot JAR layout ..... SUCCESS [  0.481 s]
[INFO] midPoint Infrastructure - pure JAXB schema ......... SUCCESS [ 12.393 s]
[INFO] midPoint Repo Commons .............................. SUCCESS [  9.904 s]
[INFO] midPoint Security Enforcer - api ................... SUCCESS [  2.487 s]
[INFO] midPoint Security Enforcer - impl .................. SUCCESS [  3.253 s]
[INFO] midPoint Provisioning .............................. SUCCESS [  0.176 s]
[INFO] midPoint Provisioning - api ........................ SUCCESS [  2.502 s]
[INFO] Unified Connector Framework - api .................. SUCCESS [  2.536 s]
[INFO] Dummy Connector .................................... SUCCESS [  1.351 s]
[INFO] Unified Connector Framework - ConnId impl .......... SUCCESS [  9.227 s]
[INFO] Unified Connector Framework - Built-in impl ........ SUCCESS [  8.066 s]
[INFO] midPoint Provisioning - impl ....................... SUCCESS [ 13.793 s]
[INFO] midPoint Model ..................................... SUCCESS [  0.200 s]
[INFO] midPoint Model - api ............................... SUCCESS [  3.392 s]
[INFO] midPoint Model - common ............................ SUCCESS [ 12.048 s]
[INFO] midPoint Notifications - api ....................... SUCCESS [  3.436 s]
[INFO] Dummy Connector Fake ............................... SUCCESS [  0.282 s]
[INFO] midPoint Authentication - api ...................... SUCCESS [  2.925 s]
[INFO] midPoint Model - test .............................. SUCCESS [  9.107 s]
[INFO] midPoint Report - api .............................. SUCCESS [  2.215 s]
[INFO] midPoint Cases - api ............................... SUCCESS [  2.241 s]
[INFO] midPoint Access Certification - api ................ SUCCESS [  1.913 s]
[INFO] midPoint Model - impl .............................. SUCCESS [ 26.832 s]
[INFO] midPoint Notifications - impl ...................... SUCCESS [  9.003 s]
[INFO] midPoint Report - impl ............................. SUCCESS [  9.384 s]
[INFO] midPoint Model - integration tests ................. SUCCESS [  8.957 s]
[INFO] midPoint Workflow - api ............................ SUCCESS [  2.235 s]
[INFO] midPoint Cases - impl .............................. SUCCESS [  3.824 s]
[INFO] midPoint Workflow - impl ........................... SUCCESS [ 11.158 s]
[INFO] midPoint Access Certification - impl ............... SUCCESS [  9.588 s]
[INFO] midPoint Authentication - impl ..................... SUCCESS [ 12.930 s]
[INFO] midPoint REST-ish service implementation ........... SUCCESS [  4.727 s]
[INFO] midPoint Customizations ............................ SUCCESS [  0.632 s]
[INFO] midPoint User Interface ............................ SUCCESS [  0.159 s]
[INFO] midPoint User Interface - admin web gui ............ SUCCESS [02:32 min]
[INFO] midPoint Spring Boot JAR ........................... SUCCESS [ 33.236 s]
[INFO] midPoint Testing Infrastructure .................... SUCCESS [  0.131 s]
[INFO] midPoint Testing - Resource Connection Tests ....... SUCCESS [  2.534 s]
[INFO] midPoint Testing - Long Tests ...................... SUCCESS [  0.908 s]
[INFO] midPoint Testing - Story Tests ..................... SUCCESS [  3.786 s]
[INFO] midPoint Testing - REST API ........................ SUCCESS [  3.007 s]
[INFO] midPoint Distribution .............................. SUCCESS [ 32.569 s]
[INFO] midPoint API Distribution .......................... SUCCESS [02:30 min]
[INFO] midPoint JavaDoc ................................... FAILURE [02:53 min]
[INFO] ------------------------------------------------------------------------
[INFO] BUILD FAILURE
[INFO] ------------------------------------------------------------------------
[INFO] Total time:  17:14 min
[INFO] Finished at: 2025-03-26T11:23:56Z
[INFO] ------------------------------------------------------------------------
[ERROR] Failed to execute goal org.apache.maven.plugins:maven-deploy-plugin:2.8.2:deploy (default-deploy) on project javadoc: Failed to deploy artifacts: Could not transfer artifact com.evolveum.midpoint.model:certification-impl:pom:4.10-20250326.110641-211 from/to evolveum-nexus (https://nexus.evolveum.com/nexus/repository/snapshots/): transfer failed for https://nexus.evolveum.com/nexus/repository/snapshots/com/evolveum/midpoint/model/certification-impl/4.10-SNAPSHOT/certification-impl-4.10-20250326.110641-211.pom, status: 500 Server Error -> [Help 1]
[ERROR] 
[ERROR] To see the full stack trace of the errors, re-run Maven with the -e switch.
[ERROR] Re-run Maven using the -X switch to enable full debug logging.
[ERROR] 
[ERROR] For more information about the errors and possible solutions, please read the following articles:
[ERROR] [Help 1] http://cwiki.apache.org/confluence/display/MAVEN/MojoExecutionException
[ERROR] 
[ERROR] After correcting the problems, you can resume the build with the command
[ERROR]   mvn <args> -rf :javadoc
[Pipeline] }
[Pipeline] // withCredentials
[Pipeline] }
[Pipeline] // container
[Pipeline] }
[Pipeline] // stage
[Pipeline] error
[Pipeline] step


More information about the midPoint-ci mailing list