[midPoint-ci] Build failed in Jenkins: midPoint - support 4.9 - quick #313
Jenkins
noreply at evolveum.com
Mon Mar 10 16:29:01 CET 2025
See <https://jenkins.evolveum.com/job/midpoint-support-4-9-quick/313/display/redirect>
Changes:
------------------------------------------
[...truncated 5092 lines...]
[INFO] --- surefire:3.1.2:test (default-test) @ rest-impl ---
[INFO] Tests are skipped.
[INFO]
[INFO] --- jar:3.4.2:jar (default-jar) @ rest-impl ---
[INFO] Building jar: /home/jenkins/agent/workspace/midpoint-support-4-9-quick/model/rest-impl/target/rest-impl-4.9.2-SNAPSHOT.jar
[INFO]
[INFO] >>> source:3.1.0:jar (attach-sources) > generate-sources @ rest-impl >>>
[INFO]
[INFO] --- enforcer:3.4.1:enforce (enforce) @ rest-impl ---
[INFO] Rule 1: org.apache.maven.enforcer.rules.dependency.DependencyConvergence passed
[INFO] Rule 2: org.apache.maven.enforcer.rules.dependency.BannedDependencies passed
[INFO]
[INFO] --- checkstyle:3.1.2:check (validate) @ rest-impl ---
[INFO] Starting audit...
Audit done.
[INFO] You have 0 Checkstyle violations.
[INFO]
[INFO] --- gitdescribe:3.0:gitdescribe (git-describe) @ rest-impl ---
[INFO]
[INFO] <<< source:3.1.0:jar (attach-sources) < generate-sources @ rest-impl <<<
[INFO]
[INFO]
[INFO] --- source:3.1.0:jar (attach-sources) @ rest-impl ---
[INFO] Building jar: /home/jenkins/agent/workspace/midpoint-support-4-9-quick/model/rest-impl/target/rest-impl-4.9.2-SNAPSHOT-sources.jar
[INFO]
[INFO] --- dependency:3.3.0:analyze-only (analyze) @ rest-impl ---
[INFO] No dependency problems found
[INFO]
[INFO] --- install:3.1.3:install (default-install) @ rest-impl ---
[INFO] Installing /home/jenkins/agent/workspace/midpoint-support-4-9-quick/model/rest-impl/pom.xml to /root/.m2/repository/com/evolveum/midpoint/model/rest-impl/4.9.2-SNAPSHOT/rest-impl-4.9.2-SNAPSHOT.pom
[INFO] Installing /home/jenkins/agent/workspace/midpoint-support-4-9-quick/model/rest-impl/target/rest-impl-4.9.2-SNAPSHOT.jar to /root/.m2/repository/com/evolveum/midpoint/model/rest-impl/4.9.2-SNAPSHOT/rest-impl-4.9.2-SNAPSHOT.jar
[INFO] Installing /home/jenkins/agent/workspace/midpoint-support-4-9-quick/model/rest-impl/target/rest-impl-4.9.2-SNAPSHOT-sources.jar to /root/.m2/repository/com/evolveum/midpoint/model/rest-impl/4.9.2-SNAPSHOT/rest-impl-4.9.2-SNAPSHOT-sources.jar
[INFO]
[INFO] --------------------< com.evolveum.midpoint:custom >--------------------
[INFO] Building midPoint Customizations 4.9.2-SNAPSHOT [57/64]
[INFO] from custom/pom.xml
[INFO] --------------------------------[ pom ]---------------------------------
[INFO]
[INFO] --- clean:3.3.2:clean (default-clean) @ custom ---
[INFO]
[INFO] --- enforcer:3.4.1:enforce (enforce) @ custom ---
[INFO] Rule 1: org.apache.maven.enforcer.rules.dependency.DependencyConvergence passed
[INFO] Rule 2: org.apache.maven.enforcer.rules.dependency.BannedDependencies passed
[INFO]
[INFO] --- checkstyle:3.1.2:check (validate) @ custom ---
[INFO] Starting audit...
Audit done.
[INFO] You have 0 Checkstyle violations.
[INFO]
[INFO] --- gitdescribe:3.0:gitdescribe (git-describe) @ custom ---
[INFO] Setting Git Describe: v4.9.2devel-102-g86445e65cee
[INFO]
[INFO] >>> source:3.1.0:jar (attach-sources) > generate-sources @ custom >>>
[INFO]
[INFO] --- enforcer:3.4.1:enforce (enforce) @ custom ---
[INFO] Rule 1: org.apache.maven.enforcer.rules.dependency.DependencyConvergence passed
[INFO] Rule 2: org.apache.maven.enforcer.rules.dependency.BannedDependencies passed
[INFO]
[INFO] --- checkstyle:3.1.2:check (validate) @ custom ---
[INFO] Starting audit...
Audit done.
[INFO] You have 0 Checkstyle violations.
[INFO]
[INFO] --- gitdescribe:3.0:gitdescribe (git-describe) @ custom ---
[INFO]
[INFO] <<< source:3.1.0:jar (attach-sources) < generate-sources @ custom <<<
[INFO]
[INFO]
[INFO] --- source:3.1.0:jar (attach-sources) @ custom ---
[INFO]
[INFO] --- failsafe:3.1.2:integration-test (integration-test) @ custom ---
[INFO] No tests to run.
[INFO] Using configured provider org.apache.maven.surefire.testng.TestNGProvider
[INFO]
[INFO] -------------------------------------------------------
[INFO] T E S T S
[INFO] -------------------------------------------------------
[INFO] Running Integration
[INFO] Tests run: 0, Failures: 0, Errors: 0, Skipped: 0, Time elapsed: 0.312 s -- in Integration
[INFO]
[INFO] Results:
[INFO]
[INFO] Tests run: 0, Failures: 0, Errors: 0, Skipped: 0
[INFO]
[INFO]
[INFO] --- failsafe:3.1.2:verify (integration-test) @ custom ---
[INFO]
[INFO] --- dependency:3.3.0:analyze-only (analyze) @ custom ---
[INFO] Skipping pom project
[INFO]
[INFO] --- install:3.1.3:install (default-install) @ custom ---
[INFO] Installing /home/jenkins/agent/workspace/midpoint-support-4-9-quick/custom/pom.xml to /root/.m2/repository/com/evolveum/midpoint/custom/4.9.2-SNAPSHOT/custom-4.9.2-SNAPSHOT.pom
[INFO]
[INFO] -------------------< com.evolveum.midpoint.gui:gui >--------------------
[INFO] Building midPoint User Interface 4.9.2-SNAPSHOT [58/64]
[INFO] from gui/pom.xml
[INFO] --------------------------------[ pom ]---------------------------------
[INFO]
[INFO] --- clean:3.3.2:clean (default-clean) @ gui ---
[INFO]
[INFO] --- enforcer:3.4.1:enforce (enforce) @ gui ---
[INFO] Rule 1: org.apache.maven.enforcer.rules.dependency.DependencyConvergence passed
[INFO] Rule 2: org.apache.maven.enforcer.rules.dependency.BannedDependencies passed
[INFO]
[INFO] --- checkstyle:3.1.2:check (validate) @ gui ---
[INFO] Starting audit...
Audit done.
[INFO] You have 0 Checkstyle violations.
[INFO]
[INFO] --- gitdescribe:3.0:gitdescribe (git-describe) @ gui ---
[INFO] Setting Git Describe: v4.9.2devel-102-g86445e65cee
[INFO]
[INFO] >>> source:3.1.0:jar (attach-sources) > generate-sources @ gui >>>
[INFO]
[INFO] --- enforcer:3.4.1:enforce (enforce) @ gui ---
[INFO] Rule 1: org.apache.maven.enforcer.rules.dependency.DependencyConvergence passed
[INFO] Rule 2: org.apache.maven.enforcer.rules.dependency.BannedDependencies passed
[INFO]
[INFO] --- checkstyle:3.1.2:check (validate) @ gui ---
[INFO] Starting audit...
Audit done.
[INFO] You have 0 Checkstyle violations.
[INFO]
[INFO] --- gitdescribe:3.0:gitdescribe (git-describe) @ gui ---
[INFO]
[INFO] <<< source:3.1.0:jar (attach-sources) < generate-sources @ gui <<<
[INFO]
[INFO]
[INFO] --- source:3.1.0:jar (attach-sources) @ gui ---
[INFO]
[INFO] --- dependency:3.3.0:analyze-only (analyze) @ gui ---
[INFO] Skipping pom project
[INFO]
[INFO] --- install:3.1.3:install (default-install) @ gui ---
[INFO] Installing /home/jenkins/agent/workspace/midpoint-support-4-9-quick/gui/pom.xml to /root/.m2/repository/com/evolveum/midpoint/gui/gui/4.9.2-SNAPSHOT/gui-4.9.2-SNAPSHOT.pom
[INFO]
[INFO] ----------------< com.evolveum.midpoint.gui:admin-gui >-----------------
[INFO] Building midPoint User Interface - admin web gui 4.9.2-SNAPSHOT [59/64]
[INFO] from gui/admin-gui/pom.xml
[INFO] --------------------------------[ jar ]---------------------------------
[INFO]
[INFO] --- clean:3.3.2:clean (default-clean) @ admin-gui ---
[INFO]
[INFO] --- enforcer:3.4.1:enforce (enforce) @ admin-gui ---
[INFO] Rule 1: org.apache.maven.enforcer.rules.dependency.DependencyConvergence passed
[INFO] Rule 2: org.apache.maven.enforcer.rules.dependency.BannedDependencies passed
[INFO]
[INFO] --- checkstyle:3.1.2:check (validate) @ admin-gui ---
[INFO] Starting audit...
[ERROR] /home/jenkins/agent/workspace/midpoint-support-4-9-quick/gui/admin-gui/src/main/java/com/evolveum/midpoint/gui/impl/page/admin/certification/component/ActiveCampaignsPanel.java:37:1: Duplicate import to line 16 - org.apache.wicket.Component. [RedundantImport]
[ERROR] /home/jenkins/agent/workspace/midpoint-support-4-9-quick/gui/admin-gui/src/main/java/com/evolveum/midpoint/gui/impl/page/admin/certification/component/ActiveCampaignsPanel.java:38:1: Duplicate import to line 17 - org.apache.wicket.ajax.AjaxRequestTarget. [RedundantImport]
[ERROR] /home/jenkins/agent/workspace/midpoint-support-4-9-quick/gui/admin-gui/src/main/java/com/evolveum/midpoint/gui/impl/page/admin/certification/component/ActiveCampaignsPanel.java:39:1: Duplicate import to line 18 - org.apache.wicket.behavior.AttributeAppender. [RedundantImport]
[ERROR] /home/jenkins/agent/workspace/midpoint-support-4-9-quick/gui/admin-gui/src/main/java/com/evolveum/midpoint/gui/impl/page/admin/certification/component/ActiveCampaignsPanel.java:40:1: Duplicate import to line 19 - org.apache.wicket.markup.html.WebMarkupContainer. [RedundantImport]
[ERROR] /home/jenkins/agent/workspace/midpoint-support-4-9-quick/gui/admin-gui/src/main/java/com/evolveum/midpoint/gui/impl/page/admin/certification/component/ActiveCampaignsPanel.java:41:1: Duplicate import to line 20 - org.apache.wicket.model.IModel. [RedundantImport]
[ERROR] /home/jenkins/agent/workspace/midpoint-support-4-9-quick/gui/admin-gui/src/main/java/com/evolveum/midpoint/gui/impl/page/admin/certification/component/ActiveCampaignsPanel.java:42:1: Duplicate import to line 22 - org.apache.wicket.model.Model. [RedundantImport]
[ERROR] /home/jenkins/agent/workspace/midpoint-support-4-9-quick/gui/admin-gui/src/main/java/com/evolveum/midpoint/gui/impl/page/admin/certification/component/ActiveCampaignsPanel.java:44:1: Duplicate import to line 10 - java.io.Serial. [RedundantImport]
[ERROR] /home/jenkins/agent/workspace/midpoint-support-4-9-quick/gui/admin-gui/src/main/java/com/evolveum/midpoint/gui/impl/page/admin/certification/component/ActiveCampaignsPanel.java:45:1: Duplicate import to line 11 - java.util.List. [RedundantImport]
[ERROR] /home/jenkins/agent/workspace/midpoint-support-4-9-quick/gui/admin-gui/src/main/java/com/evolveum/midpoint/gui/impl/page/admin/certification/component/CampaignsPanel.java:24:1: Duplicate import to line 17 - com.evolveum.midpoint.web.component.data.column.CheckBoxHeaderColumn. [RedundantImport]
[ERROR] /home/jenkins/agent/workspace/midpoint-support-4-9-quick/gui/admin-gui/src/main/java/com/evolveum/midpoint/gui/impl/page/admin/certification/component/CampaignsPanel.java:25:1: Duplicate import to line 18 - com.evolveum.midpoint.web.component.util.SelectableBeanImpl. [RedundantImport]
Audit done.
[INFO] ------------------------------------------------------------------------
[INFO] Reactor Summary for midPoint Project 4.9.2-SNAPSHOT:
[INFO]
[INFO] midPoint Project ................................... SUCCESS [ 2.315 s]
[INFO] midPoint Infrastructure ............................ SUCCESS [ 0.159 s]
[INFO] midPoint Infrastructure - schema ................... SUCCESS [02:40 min]
[INFO] midPoint Repository ................................ SUCCESS [ 0.089 s]
[INFO] midPoint Repository - api .......................... SUCCESS [ 0.507 s]
[INFO] midPoint Task Manager - api ........................ SUCCESS [ 0.560 s]
[INFO] midPoint Infrastructure - testing utils (lvl 2) .... SUCCESS [ 6.222 s]
[INFO] midPoint Infrastructure - common ................... SUCCESS [ 31.992 s]
[INFO] midPoint Audit - api ............................... SUCCESS [ 0.399 s]
[INFO] midPoint Security - api ............................ SUCCESS [ 0.545 s]
[INFO] midPoint Repository - SQL common support ........... SUCCESS [ 0.869 s]
[INFO] midPoint Repository - sql repository ............... SUCCESS [ 4.139 s]
[INFO] midPoint System Initialization ..................... SUCCESS [ 21.330 s]
[INFO] midPoint Repository - new SQL repository ........... SUCCESS [02:55 min]
[INFO] midPoint Repository - sql repository test .......... SUCCESS [ 2.791 s]
[INFO] midPoint Repository Cache .......................... SUCCESS [ 45.485 s]
[INFO] midPoint Audit - logging impl ...................... SUCCESS [ 0.375 s]
[INFO] midPoint Icf Connectors ............................ SUCCESS [ 0.076 s]
[INFO] Dummy Resource ..................................... SUCCESS [ 1.611 s]
[INFO] midPoint Repository - test utils ................... SUCCESS [ 3.459 s]
[INFO] midPoint Security - impl ........................... SUCCESS [ 1.583 s]
[INFO] midPoint Task Manager - Quartz impl ................ SUCCESS [01:55 min]
[INFO] midPoint Tools ..................................... SUCCESS [ 0.094 s]
[INFO] midPoint Tools - Ninja ............................. SUCCESS [ 49.602 s]
[INFO] midPoint Tools - custom Spring Boot JAR layout ..... SUCCESS [ 0.174 s]
[INFO] midPoint Infrastructure - pure JAXB schema ......... SUCCESS [ 11.746 s]
[INFO] midPoint Repo Commons .............................. SUCCESS [01:41 min]
[INFO] midPoint Security Enforcer - api ................... SUCCESS [ 0.383 s]
[INFO] midPoint Security Enforcer - impl .................. SUCCESS [ 0.734 s]
[INFO] midPoint Provisioning .............................. SUCCESS [ 0.080 s]
[INFO] midPoint Provisioning - api ........................ SUCCESS [ 0.466 s]
[INFO] Unified Connector Framework - api .................. SUCCESS [ 0.545 s]
[INFO] Dummy Connector .................................... SUCCESS [ 0.522 s]
[INFO] Unified Connector Framework - ConnId impl .......... SUCCESS [01:42 min]
[INFO] Unified Connector Framework - Built-in impl ........ SUCCESS [ 1.043 s]
[INFO] midPoint Provisioning - impl ....................... SUCCESS [11:28 min]
[INFO] midPoint Model ..................................... SUCCESS [ 0.092 s]
[INFO] midPoint Model - api ............................... SUCCESS [ 1.371 s]
[INFO] midPoint Model - common ............................ SUCCESS [ 37.965 s]
[INFO] midPoint Notifications - api ....................... SUCCESS [ 0.364 s]
[INFO] Dummy Connector Fake ............................... SUCCESS [ 0.164 s]
[INFO] midPoint Authentication - api ...................... SUCCESS [ 0.515 s]
[INFO] midPoint Model - test .............................. SUCCESS [ 1.992 s]
[INFO] midPoint Report - api .............................. SUCCESS [ 0.286 s]
[INFO] midPoint Cases - api ............................... SUCCESS [ 0.409 s]
[INFO] midPoint Access Certification - api ................ SUCCESS [ 0.320 s]
[INFO] midPoint Model - impl .............................. SUCCESS [04:33 min]
[INFO] midPoint Notifications - impl ...................... SUCCESS [ 23.272 s]
[INFO] midPoint Report - impl ............................. SUCCESS [03:20 min]
[INFO] midPoint Model - integration tests ................. SUCCESS [03:39 min]
[INFO] midPoint Workflow - api ............................ SUCCESS [ 0.326 s]
[INFO] midPoint Cases - impl .............................. SUCCESS [ 0.802 s]
[INFO] midPoint Workflow - impl ........................... SUCCESS [05:36 min]
[INFO] midPoint Access Certification - impl ............... SUCCESS [01:44 min]
[INFO] midPoint Authentication - impl ..................... SUCCESS [01:00 min]
[INFO] midPoint REST-ish service implementation ........... SUCCESS [ 0.796 s]
[INFO] midPoint Customizations ............................ SUCCESS [ 0.623 s]
[INFO] midPoint User Interface ............................ SUCCESS [ 0.093 s]
[INFO] midPoint User Interface - admin web gui ............ FAILURE [ 9.807 s]
[INFO] midPoint Testing Infrastructure .................... SKIPPED
[INFO] midPoint Testing - Resource Connection Tests ....... SKIPPED
[INFO] midPoint Testing - Long Tests ...................... SKIPPED
[INFO] midPoint Testing - Story Tests ..................... SKIPPED
[INFO] midPoint Testing - REST API ........................ SKIPPED
[INFO] ------------------------------------------------------------------------
[INFO] BUILD FAILURE
[INFO] ------------------------------------------------------------------------
[INFO] Total time: 46:48 min
[INFO] Finished at: 2025-03-10T15:29:00Z
[INFO] ------------------------------------------------------------------------
[ERROR] Failed to execute goal org.apache.maven.plugins:maven-checkstyle-plugin:3.1.2:check (validate) on project admin-gui: Failed during checkstyle execution: There are 10 errors reported by Checkstyle 8.43 with /home/jenkins/agent/workspace/midpoint-support-4-9-quick/config/checkstyle/checkstyle.xml ruleset. -> [Help 1]
[ERROR]
[ERROR] To see the full stack trace of the errors, re-run Maven with the -e switch.
[ERROR] Re-run Maven using the -X switch to enable full debug logging.
[ERROR]
[ERROR] For more information about the errors and possible solutions, please read the following articles:
[ERROR] [Help 1] http://cwiki.apache.org/confluence/display/MAVEN/MojoExecutionException
[ERROR]
[ERROR] After correcting the problems, you can resume the build with the command
[ERROR] mvn <args> -rf :admin-gui
[Pipeline] }
[Pipeline] // container
[Pipeline] }
[Pipeline] // stage
[Pipeline] error
[Pipeline] step
More information about the midPoint-ci
mailing list