[midPoint-ci] Build failed in Jenkins: midPoint - support 4.9 - compile #382

Jenkins noreply at evolveum.com
Mon Mar 10 11:34:49 CET 2025


See <https://jenkins.evolveum.com/job/midpoint-support-4-9-compile/382/display/redirect>

Changes:


------------------------------------------
[...truncated 3985 lines...]
[INFO] 
[INFO] ---------------< com.evolveum.midpoint.model:rest-impl >----------------
[INFO] Building midPoint REST-ish service implementation 4.9.2-SNAPSHOT [56/64]
[INFO]   from model/rest-impl/pom.xml
[INFO] --------------------------------[ jar ]---------------------------------
[INFO] 
[INFO] --- clean:3.3.2:clean (default-clean) @ rest-impl ---
[INFO] 
[INFO] --- enforcer:3.4.1:enforce (enforce) @ rest-impl ---
[INFO] Rule 1: org.apache.maven.enforcer.rules.dependency.DependencyConvergence passed
[INFO] Rule 2: org.apache.maven.enforcer.rules.dependency.BannedDependencies passed
[INFO] 
[INFO] --- checkstyle:3.1.2:check (validate) @ rest-impl ---
[INFO] Starting audit...
Audit done.
[INFO] You have 0 Checkstyle violations.
[INFO] 
[INFO] --- gitdescribe:3.0:gitdescribe (git-describe) @ rest-impl ---
[INFO] Setting Git Describe: v4.9.2devel-98-g276602df550
[INFO] 
[INFO] --- resources:3.1.0:resources (default-resources) @ rest-impl ---
[INFO] Using 'UTF-8' encoding to copy filtered resources.
[INFO] skip non existing resourceDirectory /home/jenkins/agent/workspace/midpoint-support-4-9-compile/model/rest-impl/src/main/resources
[INFO] 
[INFO] --- compiler:3.11.0:compile (default-compile) @ rest-impl ---
[INFO] Changes detected - recompiling the module! :dependency
[INFO] Compiling 12 source files with javac [debug target 17] to target/classes
[WARNING] system modules path not set in conjunction with -source 17
[INFO] /home/jenkins/agent/workspace/midpoint-support-4-9-compile/model/rest-impl/src/main/java/com/evolveum/midpoint/rest/impl/ModelRestController.java: /home/jenkins/agent/workspace/midpoint-support-4-9-compile/model/rest-impl/src/main/java/com/evolveum/midpoint/rest/impl/ModelRestController.java uses unchecked or unsafe operations.
[INFO] /home/jenkins/agent/workspace/midpoint-support-4-9-compile/model/rest-impl/src/main/java/com/evolveum/midpoint/rest/impl/ModelRestController.java: Recompile with -Xlint:unchecked for details.
[INFO] 
[INFO] --- resources:3.1.0:testResources (default-testResources) @ rest-impl ---
[INFO] Not copying test resources
[INFO] 
[INFO] --- compiler:3.11.0:testCompile (default-testCompile) @ rest-impl ---
[INFO] Not compiling test sources
[INFO] 
[INFO] --- surefire:3.1.2:test (default-test) @ rest-impl ---
[INFO] Tests are skipped.
[INFO] 
[INFO] --- jar:3.4.2:jar (default-jar) @ rest-impl ---
[INFO] Building jar: /home/jenkins/agent/workspace/midpoint-support-4-9-compile/model/rest-impl/target/rest-impl-4.9.2-SNAPSHOT.jar
[INFO] 
[INFO] >>> source:3.1.0:jar (attach-sources) > generate-sources @ rest-impl >>>
[INFO] 
[INFO] --- enforcer:3.4.1:enforce (enforce) @ rest-impl ---
[INFO] Rule 1: org.apache.maven.enforcer.rules.dependency.DependencyConvergence passed
[INFO] Rule 2: org.apache.maven.enforcer.rules.dependency.BannedDependencies passed
[INFO] 
[INFO] --- checkstyle:3.1.2:check (validate) @ rest-impl ---
[INFO] Starting audit...
Audit done.
[INFO] You have 0 Checkstyle violations.
[INFO] 
[INFO] --- gitdescribe:3.0:gitdescribe (git-describe) @ rest-impl ---
[INFO] 
[INFO] <<< source:3.1.0:jar (attach-sources) < generate-sources @ rest-impl <<<
[INFO] 
[INFO] 
[INFO] --- source:3.1.0:jar (attach-sources) @ rest-impl ---
[INFO] Building jar: /home/jenkins/agent/workspace/midpoint-support-4-9-compile/model/rest-impl/target/rest-impl-4.9.2-SNAPSHOT-sources.jar
[INFO] 
[INFO] --------------------< com.evolveum.midpoint:custom >--------------------
[INFO] Building midPoint Customizations 4.9.2-SNAPSHOT                  [57/64]
[INFO]   from custom/pom.xml
[INFO] --------------------------------[ pom ]---------------------------------
[INFO] 
[INFO] --- clean:3.3.2:clean (default-clean) @ custom ---
[INFO] 
[INFO] --- enforcer:3.4.1:enforce (enforce) @ custom ---
[INFO] Rule 1: org.apache.maven.enforcer.rules.dependency.DependencyConvergence passed
[INFO] Rule 2: org.apache.maven.enforcer.rules.dependency.BannedDependencies passed
[INFO] 
[INFO] --- checkstyle:3.1.2:check (validate) @ custom ---
[INFO] Starting audit...
Audit done.
[INFO] You have 0 Checkstyle violations.
[INFO] 
[INFO] --- gitdescribe:3.0:gitdescribe (git-describe) @ custom ---
[INFO] Setting Git Describe: v4.9.2devel-98-g276602df550
[INFO] 
[INFO] >>> source:3.1.0:jar (attach-sources) > generate-sources @ custom >>>
[INFO] 
[INFO] --- enforcer:3.4.1:enforce (enforce) @ custom ---
[INFO] Rule 1: org.apache.maven.enforcer.rules.dependency.DependencyConvergence passed
[INFO] Rule 2: org.apache.maven.enforcer.rules.dependency.BannedDependencies passed
[INFO] 
[INFO] --- checkstyle:3.1.2:check (validate) @ custom ---
[INFO] Starting audit...
Audit done.
[INFO] You have 0 Checkstyle violations.
[INFO] 
[INFO] --- gitdescribe:3.0:gitdescribe (git-describe) @ custom ---
[INFO] 
[INFO] <<< source:3.1.0:jar (attach-sources) < generate-sources @ custom <<<
[INFO] 
[INFO] 
[INFO] --- source:3.1.0:jar (attach-sources) @ custom ---
[INFO] 
[INFO] -------------------< com.evolveum.midpoint.gui:gui >--------------------
[INFO] Building midPoint User Interface 4.9.2-SNAPSHOT                  [58/64]
[INFO]   from gui/pom.xml
[INFO] --------------------------------[ pom ]---------------------------------
[INFO] 
[INFO] --- clean:3.3.2:clean (default-clean) @ gui ---
[INFO] 
[INFO] --- enforcer:3.4.1:enforce (enforce) @ gui ---
[INFO] Rule 1: org.apache.maven.enforcer.rules.dependency.DependencyConvergence passed
[INFO] Rule 2: org.apache.maven.enforcer.rules.dependency.BannedDependencies passed
[INFO] 
[INFO] --- checkstyle:3.1.2:check (validate) @ gui ---
[INFO] Starting audit...
Audit done.
[INFO] You have 0 Checkstyle violations.
[INFO] 
[INFO] --- gitdescribe:3.0:gitdescribe (git-describe) @ gui ---
[INFO] Setting Git Describe: v4.9.2devel-98-g276602df550
[INFO] 
[INFO] >>> source:3.1.0:jar (attach-sources) > generate-sources @ gui >>>
[INFO] 
[INFO] --- enforcer:3.4.1:enforce (enforce) @ gui ---
[INFO] Rule 1: org.apache.maven.enforcer.rules.dependency.DependencyConvergence passed
[INFO] Rule 2: org.apache.maven.enforcer.rules.dependency.BannedDependencies passed
[INFO] 
[INFO] --- checkstyle:3.1.2:check (validate) @ gui ---
[INFO] Starting audit...
Audit done.
[INFO] You have 0 Checkstyle violations.
[INFO] 
[INFO] --- gitdescribe:3.0:gitdescribe (git-describe) @ gui ---
[INFO] 
[INFO] <<< source:3.1.0:jar (attach-sources) < generate-sources @ gui <<<
[INFO] 
[INFO] 
[INFO] --- source:3.1.0:jar (attach-sources) @ gui ---
[INFO] 
[INFO] ----------------< com.evolveum.midpoint.gui:admin-gui >-----------------
[INFO] Building midPoint User Interface - admin web gui 4.9.2-SNAPSHOT  [59/64]
[INFO]   from gui/admin-gui/pom.xml
[INFO] --------------------------------[ jar ]---------------------------------
[INFO] 
[INFO] --- clean:3.3.2:clean (default-clean) @ admin-gui ---
[INFO] 
[INFO] --- enforcer:3.4.1:enforce (enforce) @ admin-gui ---
[INFO] Rule 1: org.apache.maven.enforcer.rules.dependency.DependencyConvergence passed
[INFO] Rule 2: org.apache.maven.enforcer.rules.dependency.BannedDependencies passed
[INFO] 
[INFO] --- checkstyle:3.1.2:check (validate) @ admin-gui ---
[INFO] Starting audit...
[ERROR] /home/jenkins/agent/workspace/midpoint-support-4-9-compile/gui/admin-gui/src/main/java/com/evolveum/midpoint/gui/impl/page/admin/certification/component/ActiveCampaignsPanel.java:36:1: Duplicate import to line 16 - org.apache.wicket.Component. [RedundantImport]
[ERROR] /home/jenkins/agent/workspace/midpoint-support-4-9-compile/gui/admin-gui/src/main/java/com/evolveum/midpoint/gui/impl/page/admin/certification/component/ActiveCampaignsPanel.java:37:1: Duplicate import to line 17 - org.apache.wicket.ajax.AjaxRequestTarget. [RedundantImport]
[ERROR] /home/jenkins/agent/workspace/midpoint-support-4-9-compile/gui/admin-gui/src/main/java/com/evolveum/midpoint/gui/impl/page/admin/certification/component/ActiveCampaignsPanel.java:38:1: Duplicate import to line 18 - org.apache.wicket.behavior.AttributeAppender. [RedundantImport]
[ERROR] /home/jenkins/agent/workspace/midpoint-support-4-9-compile/gui/admin-gui/src/main/java/com/evolveum/midpoint/gui/impl/page/admin/certification/component/ActiveCampaignsPanel.java:39:1: Duplicate import to line 19 - org.apache.wicket.markup.html.WebMarkupContainer. [RedundantImport]
[ERROR] /home/jenkins/agent/workspace/midpoint-support-4-9-compile/gui/admin-gui/src/main/java/com/evolveum/midpoint/gui/impl/page/admin/certification/component/ActiveCampaignsPanel.java:40:1: Duplicate import to line 20 - org.apache.wicket.model.IModel. [RedundantImport]
[ERROR] /home/jenkins/agent/workspace/midpoint-support-4-9-compile/gui/admin-gui/src/main/java/com/evolveum/midpoint/gui/impl/page/admin/certification/component/ActiveCampaignsPanel.java:41:1: Duplicate import to line 21 - org.apache.wicket.model.Model. [RedundantImport]
[ERROR] /home/jenkins/agent/workspace/midpoint-support-4-9-compile/gui/admin-gui/src/main/java/com/evolveum/midpoint/gui/impl/page/admin/certification/component/ActiveCampaignsPanel.java:43:1: Duplicate import to line 10 - java.io.Serial. [RedundantImport]
[ERROR] /home/jenkins/agent/workspace/midpoint-support-4-9-compile/gui/admin-gui/src/main/java/com/evolveum/midpoint/gui/impl/page/admin/certification/component/ActiveCampaignsPanel.java:44:1: Duplicate import to line 11 - java.util.List. [RedundantImport]
[ERROR] /home/jenkins/agent/workspace/midpoint-support-4-9-compile/gui/admin-gui/src/main/java/com/evolveum/midpoint/gui/impl/page/admin/certification/component/CampaignsPanel.java:24:1: Duplicate import to line 17 - com.evolveum.midpoint.web.component.data.column.CheckBoxHeaderColumn. [RedundantImport]
[ERROR] /home/jenkins/agent/workspace/midpoint-support-4-9-compile/gui/admin-gui/src/main/java/com/evolveum/midpoint/gui/impl/page/admin/certification/component/CampaignsPanel.java:25:1: Duplicate import to line 18 - com.evolveum.midpoint.web.component.util.SelectableBeanImpl. [RedundantImport]
Audit done.
[INFO] ------------------------------------------------------------------------
[INFO] Reactor Summary for midPoint Project 4.9.2-SNAPSHOT:
[INFO] 
[INFO] midPoint Project ................................... SUCCESS [ 12.997 s]
[INFO] midPoint Infrastructure ............................ SUCCESS [  0.115 s]
[INFO] midPoint Infrastructure - schema ................... SUCCESS [01:51 min]
[INFO] midPoint Repository ................................ SUCCESS [  0.086 s]
[INFO] midPoint Repository - api .......................... SUCCESS [  0.453 s]
[INFO] midPoint Task Manager - api ........................ SUCCESS [  1.135 s]
[INFO] midPoint Infrastructure - testing utils (lvl 2) .... SUCCESS [ 13.804 s]
[INFO] midPoint Infrastructure - common ................... SUCCESS [  1.969 s]
[INFO] midPoint Audit - api ............................... SUCCESS [  0.355 s]
[INFO] midPoint Security - api ............................ SUCCESS [  0.714 s]
[INFO] midPoint Repository - SQL common support ........... SUCCESS [  1.200 s]
[INFO] midPoint Repository - sql repository ............... SUCCESS [  6.438 s]
[INFO] midPoint System Initialization ..................... SUCCESS [ 31.728 s]
[INFO] midPoint Repository - new SQL repository ........... SUCCESS [  7.380 s]
[INFO] midPoint Repository - sql repository test .......... SUCCESS [  3.083 s]
[INFO] midPoint Repository Cache .......................... SUCCESS [  1.326 s]
[INFO] midPoint Audit - logging impl ...................... SUCCESS [  0.256 s]
[INFO] midPoint Icf Connectors ............................ SUCCESS [  0.067 s]
[INFO] Dummy Resource ..................................... SUCCESS [  0.674 s]
[INFO] midPoint Repository - test utils ................... SUCCESS [  3.460 s]
[INFO] midPoint Security - impl ........................... SUCCESS [  0.624 s]
[INFO] midPoint Task Manager - Quartz impl ................ SUCCESS [  2.051 s]
[INFO] midPoint Tools ..................................... SUCCESS [  0.063 s]
[INFO] midPoint Tools - Ninja ............................. SUCCESS [  4.636 s]
[INFO] midPoint Tools - custom Spring Boot JAR layout ..... SUCCESS [  0.209 s]
[INFO] midPoint Infrastructure - pure JAXB schema ......... SUCCESS [ 15.586 s]
[INFO] midPoint Repo Commons .............................. SUCCESS [  3.483 s]
[INFO] midPoint Security Enforcer - api ................... SUCCESS [  0.309 s]
[INFO] midPoint Security Enforcer - impl .................. SUCCESS [  0.649 s]
[INFO] midPoint Provisioning .............................. SUCCESS [  0.060 s]
[INFO] midPoint Provisioning - api ........................ SUCCESS [  0.425 s]
[INFO] Unified Connector Framework - api .................. SUCCESS [  0.457 s]
[INFO] Dummy Connector .................................... SUCCESS [  0.543 s]
[INFO] Unified Connector Framework - ConnId impl .......... SUCCESS [  2.685 s]
[INFO] Unified Connector Framework - Built-in impl ........ SUCCESS [  1.984 s]
[INFO] midPoint Provisioning - impl ....................... SUCCESS [  5.742 s]
[INFO] midPoint Model ..................................... SUCCESS [  0.064 s]
[INFO] midPoint Model - api ............................... SUCCESS [  1.394 s]
[INFO] midPoint Model - common ............................ SUCCESS [  4.244 s]
[INFO] midPoint Notifications - api ....................... SUCCESS [  0.334 s]
[INFO] Dummy Connector Fake ............................... SUCCESS [  0.178 s]
[INFO] midPoint Authentication - api ...................... SUCCESS [  0.729 s]
[INFO] midPoint Model - test .............................. SUCCESS [  1.976 s]
[INFO] midPoint Report - api .............................. SUCCESS [  0.228 s]
[INFO] midPoint Cases - api ............................... SUCCESS [  0.340 s]
[INFO] midPoint Access Certification - api ................ SUCCESS [  0.266 s]
[INFO] midPoint Model - impl .............................. SUCCESS [ 15.203 s]
[INFO] midPoint Notifications - impl ...................... SUCCESS [  2.136 s]
[INFO] midPoint Report - impl ............................. SUCCESS [  2.037 s]
[INFO] midPoint Model - integration tests ................. SUCCESS [  7.575 s]
[INFO] midPoint Workflow - api ............................ SUCCESS [  0.268 s]
[INFO] midPoint Cases - impl .............................. SUCCESS [  0.710 s]
[INFO] midPoint Workflow - impl ........................... SUCCESS [  2.384 s]
[INFO] midPoint Access Certification - impl ............... SUCCESS [  2.063 s]
[INFO] midPoint Authentication - impl ..................... SUCCESS [  6.029 s]
[INFO] midPoint REST-ish service implementation ........... SUCCESS [  0.698 s]
[INFO] midPoint Customizations ............................ SUCCESS [  0.071 s]
[INFO] midPoint User Interface ............................ SUCCESS [  0.071 s]
[INFO] midPoint User Interface - admin web gui ............ FAILURE [ 13.872 s]
[INFO] midPoint Testing Infrastructure .................... SKIPPED
[INFO] midPoint Testing - Resource Connection Tests ....... SKIPPED
[INFO] midPoint Testing - Long Tests ...................... SKIPPED
[INFO] midPoint Testing - Story Tests ..................... SKIPPED
[INFO] midPoint Testing - REST API ........................ SKIPPED
[INFO] ------------------------------------------------------------------------
[INFO] BUILD FAILURE
[INFO] ------------------------------------------------------------------------
[INFO] Total time:  05:04 min
[INFO] Finished at: 2025-03-10T10:34:47Z
[INFO] ------------------------------------------------------------------------
[ERROR] Failed to execute goal org.apache.maven.plugins:maven-checkstyle-plugin:3.1.2:check (validate) on project admin-gui: Failed during checkstyle execution: There are 10 errors reported by Checkstyle 8.43 with /home/jenkins/agent/workspace/midpoint-support-4-9-compile/config/checkstyle/checkstyle.xml ruleset. -> [Help 1]
[ERROR] 
[ERROR] To see the full stack trace of the errors, re-run Maven with the -e switch.
[ERROR] Re-run Maven using the -X switch to enable full debug logging.
[ERROR] 
[ERROR] For more information about the errors and possible solutions, please read the following articles:
[ERROR] [Help 1] http://cwiki.apache.org/confluence/display/MAVEN/MojoExecutionException
[ERROR] 
[ERROR] After correcting the problems, you can resume the build with the command
[ERROR]   mvn <args> -rf :admin-gui
[Pipeline] }
[Pipeline] // container
[Pipeline] }
[Pipeline] // stage
[Pipeline] error
[Pipeline] step


More information about the midPoint-ci mailing list