[midPoint-ci] Build failed in Jenkins: midPoint - master - quick #3801

Jenkins noreply at evolveum.com
Fri Jan 24 10:09:18 CET 2025


See <https://jenkins.evolveum.com/job/midpoint-master-quick/3801/display/redirect>

Changes:


------------------------------------------
[...truncated 5101 lines...]
[INFO] /home/jenkins/agent/workspace/midpoint-master-quick/model/rest-impl/src/main/java/com/evolveum/midpoint/rest/impl/ModelRestController.java: /home/jenkins/agent/workspace/midpoint-master-quick/model/rest-impl/src/main/java/com/evolveum/midpoint/rest/impl/ModelRestController.java uses unchecked or unsafe operations.
[INFO] /home/jenkins/agent/workspace/midpoint-master-quick/model/rest-impl/src/main/java/com/evolveum/midpoint/rest/impl/ModelRestController.java: Recompile with -Xlint:unchecked for details.
[INFO] 
[INFO] --- resources:3.1.0:testResources (default-testResources) @ rest-impl ---
[INFO] Not copying test resources
[INFO] 
[INFO] --- compiler:3.11.0:testCompile (default-testCompile) @ rest-impl ---
[INFO] Not compiling test sources
[INFO] 
[INFO] --- surefire:3.1.2:test (default-test) @ rest-impl ---
[INFO] Tests are skipped.
[INFO] 
[INFO] --- jar:3.4.2:jar (default-jar) @ rest-impl ---
[INFO] Building jar: /home/jenkins/agent/workspace/midpoint-master-quick/model/rest-impl/target/rest-impl-4.10-SNAPSHOT.jar
[INFO] 
[INFO] >>> source:3.1.0:jar (attach-sources) > generate-sources @ rest-impl >>>
[INFO] 
[INFO] --- enforcer:3.5.0:enforce (enforce) @ rest-impl ---
[INFO] Rule 1: org.apache.maven.enforcer.rules.dependency.DependencyConvergence passed
[INFO] Rule 2: org.apache.maven.enforcer.rules.dependency.BannedDependencies passed
[INFO] 
[INFO] --- checkstyle:3.1.2:check (validate) @ rest-impl ---
[INFO] Starting audit...
Audit done.
[INFO] You have 0 Checkstyle violations.
[INFO] 
[INFO] --- gitdescribe:3.0:gitdescribe (git-describe) @ rest-impl ---
[INFO] 
[INFO] <<< source:3.1.0:jar (attach-sources) < generate-sources @ rest-impl <<<
[INFO] 
[INFO] 
[INFO] --- source:3.1.0:jar (attach-sources) @ rest-impl ---
[INFO] Building jar: /home/jenkins/agent/workspace/midpoint-master-quick/model/rest-impl/target/rest-impl-4.10-SNAPSHOT-sources.jar
[INFO] 
[INFO] --- dependency:3.3.0:analyze-only (analyze) @ rest-impl ---
[INFO] No dependency problems found
[INFO] 
[INFO] --- install:3.1.3:install (default-install) @ rest-impl ---
[INFO] Installing /home/jenkins/agent/workspace/midpoint-master-quick/model/rest-impl/pom.xml to /root/.m2/repository/com/evolveum/midpoint/model/rest-impl/4.10-SNAPSHOT/rest-impl-4.10-SNAPSHOT.pom
[INFO] Installing /home/jenkins/agent/workspace/midpoint-master-quick/model/rest-impl/target/rest-impl-4.10-SNAPSHOT.jar to /root/.m2/repository/com/evolveum/midpoint/model/rest-impl/4.10-SNAPSHOT/rest-impl-4.10-SNAPSHOT.jar
[INFO] Installing /home/jenkins/agent/workspace/midpoint-master-quick/model/rest-impl/target/rest-impl-4.10-SNAPSHOT-sources.jar to /root/.m2/repository/com/evolveum/midpoint/model/rest-impl/4.10-SNAPSHOT/rest-impl-4.10-SNAPSHOT-sources.jar
[INFO] 
[INFO] --------------------< com.evolveum.midpoint:custom >--------------------
[INFO] Building midPoint Customizations 4.10-SNAPSHOT                   [57/64]
[INFO]   from custom/pom.xml
[INFO] --------------------------------[ pom ]---------------------------------
[INFO] 
[INFO] --- clean:3.4.0:clean (default-clean) @ custom ---
[INFO] 
[INFO] --- enforcer:3.5.0:enforce (enforce) @ custom ---
[INFO] Rule 1: org.apache.maven.enforcer.rules.dependency.DependencyConvergence passed
[INFO] Rule 2: org.apache.maven.enforcer.rules.dependency.BannedDependencies passed
[INFO] 
[INFO] --- checkstyle:3.1.2:check (validate) @ custom ---
[INFO] Starting audit...
Audit done.
[INFO] You have 0 Checkstyle violations.
[INFO] 
[INFO] --- gitdescribe:3.0:gitdescribe (git-describe) @ custom ---
[INFO] Setting Git Describe: v4.10devel-706-gb2f83b6b2a0
[INFO] 
[INFO] >>> source:3.1.0:jar (attach-sources) > generate-sources @ custom >>>
[INFO] 
[INFO] --- enforcer:3.5.0:enforce (enforce) @ custom ---
[INFO] Rule 1: org.apache.maven.enforcer.rules.dependency.DependencyConvergence passed
[INFO] Rule 2: org.apache.maven.enforcer.rules.dependency.BannedDependencies passed
[INFO] 
[INFO] --- checkstyle:3.1.2:check (validate) @ custom ---
[INFO] Starting audit...
Audit done.
[INFO] You have 0 Checkstyle violations.
[INFO] 
[INFO] --- gitdescribe:3.0:gitdescribe (git-describe) @ custom ---
[INFO] 
[INFO] <<< source:3.1.0:jar (attach-sources) < generate-sources @ custom <<<
[INFO] 
[INFO] 
[INFO] --- source:3.1.0:jar (attach-sources) @ custom ---
[INFO] 
[INFO] --- failsafe:3.1.2:integration-test (integration-test) @ custom ---
[INFO] No tests to run.
[INFO] Using configured provider org.apache.maven.surefire.testng.TestNGProvider
[INFO] 
[INFO] -------------------------------------------------------
[INFO]  T E S T S
[INFO] -------------------------------------------------------
[INFO] Running Integration
[INFO] Tests run: 0, Failures: 0, Errors: 0, Skipped: 0, Time elapsed: 0.318 s -- in Integration
[INFO] 
[INFO] Results:
[INFO] 
[INFO] Tests run: 0, Failures: 0, Errors: 0, Skipped: 0
[INFO] 
[INFO] 
[INFO] --- failsafe:3.1.2:verify (integration-test) @ custom ---
[INFO] 
[INFO] --- dependency:3.3.0:analyze-only (analyze) @ custom ---
[INFO] Skipping pom project
[INFO] 
[INFO] --- install:3.1.3:install (default-install) @ custom ---
[INFO] Installing /home/jenkins/agent/workspace/midpoint-master-quick/custom/pom.xml to /root/.m2/repository/com/evolveum/midpoint/custom/4.10-SNAPSHOT/custom-4.10-SNAPSHOT.pom
[INFO] 
[INFO] -------------------< com.evolveum.midpoint.gui:gui >--------------------
[INFO] Building midPoint User Interface 4.10-SNAPSHOT                   [58/64]
[INFO]   from gui/pom.xml
[INFO] --------------------------------[ pom ]---------------------------------
[INFO] 
[INFO] --- clean:3.4.0:clean (default-clean) @ gui ---
[INFO] 
[INFO] --- enforcer:3.5.0:enforce (enforce) @ gui ---
[INFO] Rule 1: org.apache.maven.enforcer.rules.dependency.DependencyConvergence passed
[INFO] Rule 2: org.apache.maven.enforcer.rules.dependency.BannedDependencies passed
[INFO] 
[INFO] --- checkstyle:3.1.2:check (validate) @ gui ---
[INFO] Starting audit...
Audit done.
[INFO] You have 0 Checkstyle violations.
[INFO] 
[INFO] --- gitdescribe:3.0:gitdescribe (git-describe) @ gui ---
[INFO] Setting Git Describe: v4.10devel-706-gb2f83b6b2a0
[INFO] 
[INFO] >>> source:3.1.0:jar (attach-sources) > generate-sources @ gui >>>
[INFO] 
[INFO] --- enforcer:3.5.0:enforce (enforce) @ gui ---
[INFO] Rule 1: org.apache.maven.enforcer.rules.dependency.DependencyConvergence passed
[INFO] Rule 2: org.apache.maven.enforcer.rules.dependency.BannedDependencies passed
[INFO] 
[INFO] --- checkstyle:3.1.2:check (validate) @ gui ---
[INFO] Starting audit...
Audit done.
[INFO] You have 0 Checkstyle violations.
[INFO] 
[INFO] --- gitdescribe:3.0:gitdescribe (git-describe) @ gui ---
[INFO] 
[INFO] <<< source:3.1.0:jar (attach-sources) < generate-sources @ gui <<<
[INFO] 
[INFO] 
[INFO] --- source:3.1.0:jar (attach-sources) @ gui ---
[INFO] 
[INFO] --- dependency:3.3.0:analyze-only (analyze) @ gui ---
[INFO] Skipping pom project
[INFO] 
[INFO] --- install:3.1.3:install (default-install) @ gui ---
[INFO] Installing /home/jenkins/agent/workspace/midpoint-master-quick/gui/pom.xml to /root/.m2/repository/com/evolveum/midpoint/gui/gui/4.10-SNAPSHOT/gui-4.10-SNAPSHOT.pom
[INFO] 
[INFO] ----------------< com.evolveum.midpoint.gui:admin-gui >-----------------
[INFO] Building midPoint User Interface - admin web gui 4.10-SNAPSHOT   [59/64]
[INFO]   from gui/admin-gui/pom.xml
[INFO] --------------------------------[ jar ]---------------------------------
[INFO] 
[INFO] --- clean:3.4.0:clean (default-clean) @ admin-gui ---
[INFO] 
[INFO] --- enforcer:3.5.0:enforce (enforce) @ admin-gui ---
[INFO] Rule 1: org.apache.maven.enforcer.rules.dependency.DependencyConvergence passed
[INFO] Rule 2: org.apache.maven.enforcer.rules.dependency.BannedDependencies passed
[INFO] 
[INFO] --- checkstyle:3.1.2:check (validate) @ admin-gui ---
[INFO] Starting audit...
[ERROR] /home/jenkins/agent/workspace/midpoint-master-quick/gui/admin-gui/src/main/java/com/evolveum/midpoint/gui/impl/component/search/panel/AxiomSearchPanel.java:54:27: Name 'ID_AXIOM_QUERY_INPUT_FIELD' must match pattern '^[a-z][a-zA-Z0-9]*$'. [StaticVariableName]
Audit done.
[INFO] ------------------------------------------------------------------------
[INFO] Reactor Summary for midPoint Project 4.10-SNAPSHOT:
[INFO] 
[INFO] midPoint Project ................................... SUCCESS [  4.346 s]
[INFO] midPoint Infrastructure ............................ SUCCESS [  0.138 s]
[INFO] midPoint Infrastructure - schema ................... SUCCESS [02:42 min]
[INFO] midPoint Repository ................................ SUCCESS [  0.106 s]
[INFO] midPoint Repository - api .......................... SUCCESS [  0.560 s]
[INFO] midPoint Task Manager - api ........................ SUCCESS [  0.684 s]
[INFO] midPoint Infrastructure - testing utils (lvl 2) .... SUCCESS [  6.898 s]
[INFO] midPoint Infrastructure - common ................... SUCCESS [ 34.769 s]
[INFO] midPoint Audit - api ............................... SUCCESS [  0.382 s]
[INFO] midPoint Security - api ............................ SUCCESS [  0.569 s]
[INFO] midPoint Repository - SQL common support ........... SUCCESS [  1.283 s]
[INFO] midPoint Repository - sql repository ............... SUCCESS [  5.955 s]
[INFO] midPoint System Initialization ..................... SUCCESS [ 24.550 s]
[INFO] midPoint Repository - new SQL repository ........... SUCCESS [02:57 min]
[INFO] midPoint Repository - sql repository test .......... SUCCESS [  3.302 s]
[INFO] midPoint Repository Cache .......................... SUCCESS [ 44.426 s]
[INFO] midPoint Audit - logging impl ...................... SUCCESS [  0.429 s]
[INFO] midPoint Icf Connectors ............................ SUCCESS [  0.139 s]
[INFO] Dummy Resource ..................................... SUCCESS [  1.802 s]
[INFO] midPoint Repository - test utils ................... SUCCESS [  3.848 s]
[INFO] midPoint Security - impl ........................... SUCCESS [  1.617 s]
[INFO] midPoint Task Manager - Quartz impl ................ SUCCESS [01:54 min]
[INFO] midPoint Tools ..................................... SUCCESS [  0.088 s]
[INFO] midPoint Tools - Ninja ............................. SUCCESS [ 58.173 s]
[INFO] midPoint Tools - custom Spring Boot JAR layout ..... SUCCESS [  0.245 s]
[INFO] midPoint Infrastructure - pure JAXB schema ......... SUCCESS [ 12.695 s]
[INFO] midPoint Repo Commons .............................. SUCCESS [01:49 min]
[INFO] midPoint Security Enforcer - api ................... SUCCESS [  0.444 s]
[INFO] midPoint Security Enforcer - impl .................. SUCCESS [  0.878 s]
[INFO] midPoint Provisioning .............................. SUCCESS [  0.090 s]
[INFO] midPoint Provisioning - api ........................ SUCCESS [  0.464 s]
[INFO] Unified Connector Framework - api .................. SUCCESS [  0.657 s]
[INFO] Dummy Connector .................................... SUCCESS [  0.541 s]
[INFO] Unified Connector Framework - ConnId impl .......... SUCCESS [01:47 min]
[INFO] Unified Connector Framework - Built-in impl ........ SUCCESS [  1.271 s]
[INFO] midPoint Provisioning - impl ....................... SUCCESS [12:21 min]
[INFO] midPoint Model ..................................... SUCCESS [  0.110 s]
[INFO] midPoint Model - api ............................... SUCCESS [  1.613 s]
[INFO] midPoint Model - common ............................ SUCCESS [ 41.285 s]
[INFO] midPoint Notifications - api ....................... SUCCESS [  0.443 s]
[INFO] Dummy Connector Fake ............................... SUCCESS [  0.180 s]
[INFO] midPoint Authentication - api ...................... SUCCESS [  0.623 s]
[INFO] midPoint Model - test .............................. SUCCESS [  2.195 s]
[INFO] midPoint Report - api .............................. SUCCESS [  0.315 s]
[INFO] midPoint Cases - api ............................... SUCCESS [  0.586 s]
[INFO] midPoint Access Certification - api ................ SUCCESS [  0.339 s]
[INFO] midPoint Model - impl .............................. SUCCESS [04:57 min]
[INFO] midPoint Notifications - impl ...................... SUCCESS [ 23.245 s]
[INFO] midPoint Report - impl ............................. SUCCESS [03:28 min]
[INFO] midPoint Model - integration tests ................. SUCCESS [04:05 min]
[INFO] midPoint Workflow - api ............................ SUCCESS [  0.386 s]
[INFO] midPoint Cases - impl .............................. SUCCESS [  0.842 s]
[INFO] midPoint Workflow - impl ........................... SUCCESS [05:47 min]
[INFO] midPoint Access Certification - impl ............... SUCCESS [01:56 min]
[INFO] midPoint Authentication - impl ..................... SUCCESS [01:07 min]
[INFO] midPoint REST-ish service implementation ........... SUCCESS [  0.791 s]
[INFO] midPoint Customizations ............................ SUCCESS [  0.646 s]
[INFO] midPoint User Interface ............................ SUCCESS [  0.093 s]
[INFO] midPoint User Interface - admin web gui ............ FAILURE [ 10.772 s]
[INFO] midPoint Testing Infrastructure .................... SKIPPED
[INFO] midPoint Testing - Resource Connection Tests ....... SKIPPED
[INFO] midPoint Testing - Long Tests ...................... SKIPPED
[INFO] midPoint Testing - Story Tests ..................... SKIPPED
[INFO] midPoint Testing - REST API ........................ SKIPPED
[INFO] ------------------------------------------------------------------------
[INFO] BUILD FAILURE
[INFO] ------------------------------------------------------------------------
[INFO] Total time:  49:53 min
[INFO] Finished at: 2025-01-24T09:09:16Z
[INFO] ------------------------------------------------------------------------
[ERROR] Failed to execute goal org.apache.maven.plugins:maven-checkstyle-plugin:3.1.2:check (validate) on project admin-gui: Failed during checkstyle execution: There is 1 error reported by Checkstyle 8.43 with /home/jenkins/agent/workspace/midpoint-master-quick/config/checkstyle/checkstyle.xml ruleset. -> [Help 1]
[ERROR] 
[ERROR] To see the full stack trace of the errors, re-run Maven with the -e switch.
[ERROR] Re-run Maven using the -X switch to enable full debug logging.
[ERROR] 
[ERROR] For more information about the errors and possible solutions, please read the following articles:
[ERROR] [Help 1] http://cwiki.apache.org/confluence/display/MAVEN/MojoExecutionException
[ERROR] 
[ERROR] After correcting the problems, you can resume the build with the command
[ERROR]   mvn <args> -rf :admin-gui
[Pipeline] }
[Pipeline] // container
[Pipeline] }
[Pipeline] // stage
[Pipeline] error
[Pipeline] step


More information about the midPoint-ci mailing list