[midPoint-ci] Build failed in Jenkins: midPoint - support 4.8 - Native repo, PG 16, JDK 21 (Eclipse Temurin) #201
Jenkins
noreply at evolveum.com
Fri Jan 10 07:33:35 CET 2025
See <https://jenkins.evolveum.com/job/midpoint-support-4-8-native-pg16-jdk21/201/display/redirect>
Changes:
------------------------------------------
[...truncated 17157 lines...]
at java.base/java.util.ArrayList.forEach(ArrayList.java:1596)
at org.testng.TestRunner.privateRun(TestRunner.java:739)
at org.testng.TestRunner.run(TestRunner.java:614)
at org.testng.SuiteRunner.runTest(SuiteRunner.java:421)
at org.testng.SuiteRunner.runSequentially(SuiteRunner.java:413)
at org.testng.SuiteRunner.privateRun(SuiteRunner.java:373)
at org.testng.SuiteRunner.run(SuiteRunner.java:312)
at org.testng.SuiteRunnerWorker.runSuite(SuiteRunnerWorker.java:52)
at org.testng.SuiteRunnerWorker.run(SuiteRunnerWorker.java:95)
at org.testng.TestNG.runSuitesSequentially(TestNG.java:1274)
at org.testng.TestNG.runSuitesLocally(TestNG.java:1208)
at org.testng.TestNG.runSuites(TestNG.java:1112)
at org.testng.TestNG.run(TestNG.java:1079)
at org.apache.maven.surefire.testng.TestNGExecutor.run(TestNGExecutor.java:308)
at org.apache.maven.surefire.testng.TestNGXmlTestSuite.execute(TestNGXmlTestSuite.java:71)
at org.apache.maven.surefire.testng.TestNGProvider.invoke(TestNGProvider.java:113)
at org.apache.maven.surefire.booter.ForkedBooter.runSuitesInProcess(ForkedBooter.java:385)
at org.apache.maven.surefire.booter.ForkedBooter.execute(ForkedBooter.java:162)
at org.apache.maven.surefire.booter.ForkedBooter.run(ForkedBooter.java:507)
at org.apache.maven.surefire.booter.ForkedBooter.main(ForkedBooter.java:495)
[INFO]
[INFO] Results:
[INFO]
[ERROR] Failures:
[ERROR] TestConfiguredCapabilitiesActivation>AbstractTestNGSpringContextTests.springTestContextPrepareTestInstance:119 » IllegalState ApplicationContext failure threshold (1) exceeded: skipping repeated attempt to load context for [MergedContextConfiguration at 2078be testClass = com.evolveum.midpoint.testing.story.TestConfiguredCapabilitiesActivation, locations = ["classpath:ctx-story-test-main.xml"], classes = [], contextInitializerClasses = [], activeProfiles = [], propertySourceDescriptors = [], propertySourceProperties = [], contextCustomizers = [], contextLoader = org.springframework.test.context.support.DelegatingSmartContextLoader, parent = null]
[ERROR] TestDelayedEnable>AbstractTestNGSpringContextTests.springTestContextPrepareTestInstance:119 » IllegalState ApplicationContext failure threshold (1) exceeded: skipping repeated attempt to load context for [MergedContextConfiguration at 36752a50 testClass = com.evolveum.midpoint.testing.story.TestDelayedEnable, locations = ["classpath:ctx-story-test-main.xml"], classes = [], contextInitializerClasses = [], activeProfiles = [], propertySourceDescriptors = [], propertySourceProperties = [], contextCustomizers = [], contextLoader = org.springframework.test.context.support.DelegatingSmartContextLoader, parent = null]
[ERROR] TestDelivery>AbstractTestNGSpringContextTests.springTestContextPrepareTestInstance:119 » IllegalState ApplicationContext failure threshold (1) exceeded: skipping repeated attempt to load context for [MergedContextConfiguration at 4e15144 testClass = com.evolveum.midpoint.testing.story.TestDelivery, locations = ["classpath:ctx-story-test-main.xml"], classes = [], contextInitializerClasses = [], activeProfiles = [], propertySourceDescriptors = [], propertySourceProperties = [], contextCustomizers = [], contextLoader = org.springframework.test.context.support.DelegatingSmartContextLoader, parent = null]
[ERROR] TestDependencyRename>AbstractTestNGSpringContextTests.springTestContextPrepareTestInstance:119 » IllegalState ApplicationContext failure threshold (1) exceeded: skipping repeated attempt to load context for [MergedContextConfiguration at 3cdc7e09 testClass = com.evolveum.midpoint.testing.story.TestDependencyRename, locations = ["classpath:ctx-story-test-main.xml"], classes = [], contextInitializerClasses = [], activeProfiles = [], propertySourceDescriptors = [], propertySourceProperties = [], contextCustomizers = [], contextLoader = org.springframework.test.context.support.DelegatingSmartContextLoader, parent = null]
[ERROR] TestExistentialIssues>AbstractTestNGSpringContextTests.springTestContextPrepareTestInstance:119 » IllegalState ApplicationContext failure threshold (1) exceeded: skipping repeated attempt to load context for [MergedContextConfiguration at 3b1fbe47 testClass = com.evolveum.midpoint.testing.story.TestExistentialIssues, locations = ["classpath:ctx-story-test-main.xml"], classes = [], contextInitializerClasses = [], activeProfiles = [], propertySourceDescriptors = [], propertySourceProperties = [], contextCustomizers = [], contextLoader = org.springframework.test.context.support.DelegatingSmartContextLoader, parent = null]
[ERROR] TestFirstSteps>AbstractTestNGSpringContextTests.springTestContextPrepareTestInstance:119 » IllegalState ApplicationContext failure threshold (1) exceeded: skipping repeated attempt to load context for [MergedContextConfiguration at 1a526bb2 testClass = com.evolveum.midpoint.testing.story.TestFirstSteps, locations = ["classpath:ctx-story-test-main.xml"], classes = [], contextInitializerClasses = [], activeProfiles = [], propertySourceDescriptors = [], propertySourceProperties = [], contextCustomizers = [], contextLoader = org.springframework.test.context.support.DelegatingSmartContextLoader, parent = null]
[ERROR] TestImportGroups>AbstractTestNGSpringContextTests.springTestContextPrepareTestInstance:119 » IllegalState ApplicationContext failure threshold (1) exceeded: skipping repeated attempt to load context for [MergedContextConfiguration at 1e601dcc testClass = com.evolveum.midpoint.testing.story.TestImportGroups, locations = ["classpath:ctx-story-test-main.xml"], classes = [], contextInitializerClasses = [], activeProfiles = [], propertySourceDescriptors = [], propertySourceProperties = [], contextCustomizers = [], contextLoader = org.springframework.test.context.support.DelegatingSmartContextLoader, parent = null]
[ERROR] TestInboundOutboundAssociation>AbstractTestNGSpringContextTests.springTestContextPrepareTestInstance:119 » IllegalState ApplicationContext failure threshold (1) exceeded: skipping repeated attempt to load context for [MergedContextConfiguration at 4b47a952 testClass = com.evolveum.midpoint.testing.story.TestInboundOutboundAssociation, locations = ["classpath:ctx-story-test-main.xml"], classes = [], contextInitializerClasses = [], activeProfiles = [], propertySourceDescriptors = [], propertySourceProperties = [], contextCustomizers = [], contextLoader = org.springframework.test.context.support.DelegatingSmartContextLoader, parent = null]
[ERROR] TestInducement>AbstractTestNGSpringContextTests.springTestContextPrepareTestInstance:119 » IllegalState ApplicationContext failure threshold (1) exceeded: skipping repeated attempt to load context for [MergedContextConfiguration at 1c6fef7f testClass = com.evolveum.midpoint.testing.story.TestInducement, locations = ["classpath:ctx-story-test-main.xml"], classes = [], contextInitializerClasses = [], activeProfiles = [], propertySourceDescriptors = [], propertySourceProperties = [], contextCustomizers = [], contextLoader = org.springframework.test.context.support.DelegatingSmartContextLoader, parent = null]
[ERROR] TestLimitedResources>AbstractTestNGSpringContextTests.springTestContextPrepareTestInstance:119 » IllegalState ApplicationContext failure threshold (1) exceeded: skipping repeated attempt to load context for [MergedContextConfiguration at af5a07 testClass = com.evolveum.midpoint.testing.story.TestLimitedResources, locations = ["classpath:ctx-story-test-main.xml"], classes = [], contextInitializerClasses = [], activeProfiles = [], propertySourceDescriptors = [], propertySourceProperties = [], contextCustomizers = [], contextLoader = org.springframework.test.context.support.DelegatingSmartContextLoader, parent = null]
[ERROR] TestMachineIntelligence>AbstractTestNGSpringContextTests.springTestContextPrepareTestInstance:119 » IllegalState ApplicationContext failure threshold (1) exceeded: skipping repeated attempt to load context for [MergedContextConfiguration at 7d48ec23 testClass = com.evolveum.midpoint.testing.story.TestMachineIntelligence, locations = ["classpath:ctx-story-test-main.xml"], classes = [], contextInitializerClasses = [], activeProfiles = [], propertySourceDescriptors = [], propertySourceProperties = [], contextCustomizers = [], contextLoader = org.springframework.test.context.support.DelegatingSmartContextLoader, parent = null]
[ERROR] TestMapleLeaf>AbstractTestNGSpringContextTests.springTestContextPrepareTestInstance:119 » IllegalState ApplicationContext failure threshold (1) exceeded: skipping repeated attempt to load context for [MergedContextConfiguration at 5ff5d477 testClass = com.evolveum.midpoint.testing.story.TestMapleLeaf, locations = ["classpath:ctx-story-test-main.xml"], classes = [], contextInitializerClasses = [], activeProfiles = [], propertySourceDescriptors = [], propertySourceProperties = [], contextCustomizers = [], contextLoader = org.springframework.test.context.support.DelegatingSmartContextLoader, parent = null]
[ERROR] TestMappingMadness>AbstractTestNGSpringContextTests.springTestContextPrepareTestInstance:119 » IllegalState ApplicationContext failure threshold (1) exceeded: skipping repeated attempt to load context for [MergedContextConfiguration at 68b6901b testClass = com.evolveum.midpoint.testing.story.TestMappingMadness, locations = ["classpath:ctx-story-test-main.xml"], classes = [], contextInitializerClasses = [], activeProfiles = [], propertySourceDescriptors = [], propertySourceProperties = [], contextCustomizers = [], contextLoader = org.springframework.test.context.support.DelegatingSmartContextLoader, parent = null]
[ERROR] TestMisbehavingResources>AbstractTestNGSpringContextTests.springTestContextPrepareTestInstance:119 » IllegalState ApplicationContext failure threshold (1) exceeded: skipping repeated attempt to load context for [MergedContextConfiguration at cc43b44 testClass = com.evolveum.midpoint.testing.story.TestMisbehavingResources, locations = ["classpath:ctx-story-test-main.xml"], classes = [], contextInitializerClasses = [], activeProfiles = [], propertySourceDescriptors = [], propertySourceProperties = [], contextCustomizers = [], contextLoader = org.springframework.test.context.support.DelegatingSmartContextLoader, parent = null]
[ERROR] TestNormalizers>AbstractTestNGSpringContextTests.springTestContextPrepareTestInstance:119 » IllegalState ApplicationContext failure threshold (1) exceeded: skipping repeated attempt to load context for [MergedContextConfiguration at 412c44 testClass = com.evolveum.midpoint.testing.story.TestNormalizers, locations = ["classpath:ctx-story-test-main.xml"], classes = [], contextInitializerClasses = [], activeProfiles = [], propertySourceDescriptors = [], propertySourceProperties = [], contextCustomizers = [], contextLoader = org.springframework.test.context.support.DelegatingSmartContextLoader, parent = null]
[ERROR] TestNullAttribute>AbstractTestNGSpringContextTests.springTestContextPrepareTestInstance:119 » IllegalState ApplicationContext failure threshold (1) exceeded: skipping repeated attempt to load context for [MergedContextConfiguration at 4a7a56c2 testClass = com.evolveum.midpoint.testing.story.TestNullAttribute, locations = ["classpath:ctx-story-test-main.xml"], classes = [], contextInitializerClasses = [], activeProfiles = [], propertySourceDescriptors = [], propertySourceProperties = [], contextCustomizers = [], contextLoader = org.springframework.test.context.support.DelegatingSmartContextLoader, parent = null]
[ERROR] TestOperationPerf>AbstractTestNGSpringContextTests.springTestContextPrepareTestInstance:119 » IllegalState ApplicationContext failure threshold (1) exceeded: skipping repeated attempt to load context for [MergedContextConfiguration at 4177c378 testClass = com.evolveum.midpoint.testing.story.TestOperationPerf, locations = ["classpath:ctx-story-test-main.xml"], classes = [], contextInitializerClasses = [], activeProfiles = [], propertySourceDescriptors = [], propertySourceProperties = [], contextCustomizers = [], contextLoader = org.springframework.test.context.support.DelegatingSmartContextLoader, parent = null]
[ERROR] TestOrgSync>AbstractTestNGSpringContextTests.springTestContextPrepareTestInstance:119 » IllegalState Failed to load ApplicationContext for [MergedContextConfiguration at 2c6ffc95 testClass = com.evolveum.midpoint.testing.story.TestOrgSync, locations = ["classpath:ctx-story-test-main.xml"], classes = [], contextInitializerClasses = [], activeProfiles = [], propertySourceDescriptors = [], propertySourceProperties = [], contextCustomizers = [], contextLoader = org.springframework.test.context.support.DelegatingSmartContextLoader, parent = null]
[ERROR] TestOrphanedTasks>AbstractTestNGSpringContextTests.springTestContextPrepareTestInstance:119 » IllegalState ApplicationContext failure threshold (1) exceeded: skipping repeated attempt to load context for [MergedContextConfiguration at 8332200 testClass = com.evolveum.midpoint.testing.story.TestOrphanedTasks, locations = ["classpath:ctx-story-test-main.xml"], classes = [], contextInitializerClasses = [], activeProfiles = [], propertySourceDescriptors = [], propertySourceProperties = [], contextCustomizers = [], contextLoader = org.springframework.test.context.support.DelegatingSmartContextLoader, parent = null]
[ERROR] TestPhotoAssignment>AbstractTestNGSpringContextTests.springTestContextPrepareTestInstance:119 » IllegalState ApplicationContext failure threshold (1) exceeded: skipping repeated attempt to load context for [MergedContextConfiguration at 71a1aef4 testClass = com.evolveum.midpoint.testing.story.TestPhotoAssignment, locations = ["classpath:ctx-story-test-main.xml"], classes = [], contextInitializerClasses = [], activeProfiles = [], propertySourceDescriptors = [], propertySourceProperties = [], contextCustomizers = [], contextLoader = org.springframework.test.context.support.DelegatingSmartContextLoader, parent = null]
[ERROR] TestPlentyOfAssignments>AbstractTestNGSpringContextTests.springTestContextPrepareTestInstance:119 » IllegalState ApplicationContext failure threshold (1) exceeded: skipping repeated attempt to load context for [MergedContextConfiguration at 61ab209b testClass = com.evolveum.midpoint.testing.story.TestPlentyOfAssignments, locations = ["classpath:ctx-story-test-main.xml"], classes = [], contextInitializerClasses = [], activeProfiles = [], propertySourceDescriptors = [], propertySourceProperties = [], contextCustomizers = [], contextLoader = org.springframework.test.context.support.DelegatingSmartContextLoader, parent = null]
[ERROR] TestReconNullValue>AbstractTestNGSpringContextTests.springTestContextPrepareTestInstance:119 » IllegalState ApplicationContext failure threshold (1) exceeded: skipping repeated attempt to load context for [MergedContextConfiguration at 48eeff84 testClass = com.evolveum.midpoint.testing.story.TestReconNullValue, locations = ["classpath:ctx-story-test-main.xml"], classes = [], contextInitializerClasses = [], activeProfiles = [], propertySourceDescriptors = [], propertySourceProperties = [], contextCustomizers = [], contextLoader = org.springframework.test.context.support.DelegatingSmartContextLoader, parent = null]
[ERROR] TestResourceInMaintenance>AbstractTestNGSpringContextTests.springTestContextPrepareTestInstance:119 » IllegalState ApplicationContext failure threshold (1) exceeded: skipping repeated attempt to load context for [MergedContextConfiguration at 4b849566 testClass = com.evolveum.midpoint.testing.story.TestResourceInMaintenance, locations = ["classpath:ctx-story-test-main.xml"], classes = [], contextInitializerClasses = [], activeProfiles = [], propertySourceDescriptors = [], propertySourceProperties = [], contextCustomizers = [], contextLoader = org.springframework.test.context.support.DelegatingSmartContextLoader, parent = null]
[ERROR] TestRetirement>AbstractTestNGSpringContextTests.springTestContextPrepareTestInstance:119 » IllegalState ApplicationContext failure threshold (1) exceeded: skipping repeated attempt to load context for [MergedContextConfiguration at 5ba9c383 testClass = com.evolveum.midpoint.testing.story.TestRetirement, locations = ["classpath:ctx-story-test-main.xml"], classes = [], contextInitializerClasses = [], activeProfiles = [], propertySourceDescriptors = [], propertySourceProperties = [], contextCustomizers = [], contextLoader = org.springframework.test.context.support.DelegatingSmartContextLoader, parent = null]
[ERROR] TestScience>AbstractTestNGSpringContextTests.springTestContextPrepareTestInstance:119 » IllegalState ApplicationContext failure threshold (1) exceeded: skipping repeated attempt to load context for [MergedContextConfiguration at 30118723 testClass = com.evolveum.midpoint.testing.story.TestScience, locations = ["classpath:ctx-story-test-main.xml"], classes = [], contextInitializerClasses = [], activeProfiles = [], propertySourceDescriptors = [], propertySourceProperties = [], contextCustomizers = [], contextLoader = org.springframework.test.context.support.DelegatingSmartContextLoader, parent = null]
[ERROR] TestServiceAccounts>AbstractTestNGSpringContextTests.springTestContextPrepareTestInstance:119 » IllegalState ApplicationContext failure threshold (1) exceeded: skipping repeated attempt to load context for [MergedContextConfiguration at 701c50ff testClass = com.evolveum.midpoint.testing.story.TestServiceAccounts, locations = ["classpath:ctx-story-test-main.xml"], classes = [], contextInitializerClasses = [], activeProfiles = [], propertySourceDescriptors = [], propertySourceProperties = [], contextCustomizers = [], contextLoader = org.springframework.test.context.support.DelegatingSmartContextLoader, parent = null]
[ERROR] TestStrings>AbstractTestNGSpringContextTests.springTestContextPrepareTestInstance:119 » IllegalState ApplicationContext failure threshold (1) exceeded: skipping repeated attempt to load context for [MergedContextConfiguration at 776508c5 testClass = com.evolveum.midpoint.testing.story.TestStrings, locations = ["classpath:ctx-story-test-main.xml"], classes = [], contextInitializerClasses = [], activeProfiles = [], propertySourceDescriptors = [], propertySourceProperties = [], contextCustomizers = [], contextLoader = org.springframework.test.context.support.DelegatingSmartContextLoader, parent = null]
[ERROR] TestThresholdsStoryLiveSyncExecute>AbstractTestNGSpringContextTests.springTestContextPrepareTestInstance:119 » IllegalState ApplicationContext failure threshold (1) exceeded: skipping repeated attempt to load context for [MergedContextConfiguration at 24126eb6 testClass = com.evolveum.midpoint.testing.story.TestThresholdsStoryLiveSyncExecute, locations = ["classpath:ctx-story-test-main.xml"], classes = [], contextInitializerClasses = [], activeProfiles = [], propertySourceDescriptors = [], propertySourceProperties = [], contextCustomizers = [], contextLoader = org.springframework.test.context.support.DelegatingSmartContextLoader, parent = null]
[ERROR] TestThresholdsStoryLiveSyncExecuteMultithreaded>AbstractTestNGSpringContextTests.springTestContextPrepareTestInstance:119 » IllegalState ApplicationContext failure threshold (1) exceeded: skipping repeated attempt to load context for [MergedContextConfiguration at 53b17ded testClass = com.evolveum.midpoint.testing.story.TestThresholdsStoryLiveSyncExecuteMultithreaded, locations = ["classpath:ctx-story-test-main.xml"], classes = [], contextInitializerClasses = [], activeProfiles = [], propertySourceDescriptors = [], propertySourceProperties = [], contextCustomizers = [], contextLoader = org.springframework.test.context.support.DelegatingSmartContextLoader, parent = null]
[ERROR] TestThresholdsStoryLiveSyncSimulate>AbstractTestNGSpringContextTests.springTestContextPrepareTestInstance:119 » IllegalState ApplicationContext failure threshold (1) exceeded: skipping repeated attempt to load context for [MergedContextConfiguration at 25529813 testClass = com.evolveum.midpoint.testing.story.TestThresholdsStoryLiveSyncSimulate, locations = ["classpath:ctx-story-test-main.xml"], classes = [], contextInitializerClasses = [], activeProfiles = [], propertySourceDescriptors = [], propertySourceProperties = [], contextCustomizers = [], contextLoader = org.springframework.test.context.support.DelegatingSmartContextLoader, parent = null]
[ERROR] TestThresholdsStoryLiveSyncSimulateMultithreaded>AbstractTestNGSpringContextTests.springTestContextPrepareTestInstance:119 » IllegalState ApplicationContext failure threshold (1) exceeded: skipping repeated attempt to load context for [MergedContextConfiguration at 7d348635 testClass = com.evolveum.midpoint.testing.story.TestThresholdsStoryLiveSyncSimulateMultithreaded, locations = ["classpath:ctx-story-test-main.xml"], classes = [], contextInitializerClasses = [], activeProfiles = [], propertySourceDescriptors = [], propertySourceProperties = [], contextCustomizers = [], contextLoader = org.springframework.test.context.support.DelegatingSmartContextLoader, parent = null]
[ERROR] TestThresholdsStoryReconExecute>AbstractTestNGSpringContextTests.springTestContextPrepareTestInstance:119 » IllegalState ApplicationContext failure threshold (1) exceeded: skipping repeated attempt to load context for [MergedContextConfiguration at 43e937fa testClass = com.evolveum.midpoint.testing.story.TestThresholdsStoryReconExecute, locations = ["classpath:ctx-story-test-main.xml"], classes = [], contextInitializerClasses = [], activeProfiles = [], propertySourceDescriptors = [], propertySourceProperties = [], contextCustomizers = [], contextLoader = org.springframework.test.context.support.DelegatingSmartContextLoader, parent = null]
[ERROR] TestThresholdsStoryReconExecuteMultinode>AbstractTestNGSpringContextTests.springTestContextPrepareTestInstance:119 » IllegalState ApplicationContext failure threshold (1) exceeded: skipping repeated attempt to load context for [MergedContextConfiguration at 1700d8a1 testClass = com.evolveum.midpoint.testing.story.TestThresholdsStoryReconExecuteMultinode, locations = ["classpath:ctx-story-test-main.xml"], classes = [], contextInitializerClasses = [], activeProfiles = [], propertySourceDescriptors = [], propertySourceProperties = [], contextCustomizers = [], contextLoader = org.springframework.test.context.support.DelegatingSmartContextLoader, parent = null]
[ERROR] TestThresholdsStoryReconExecuteMultithreaded>AbstractTestNGSpringContextTests.springTestContextPrepareTestInstance:119 » IllegalState ApplicationContext failure threshold (1) exceeded: skipping repeated attempt to load context for [MergedContextConfiguration at 55921662 testClass = com.evolveum.midpoint.testing.story.TestThresholdsStoryReconExecuteMultithreaded, locations = ["classpath:ctx-story-test-main.xml"], classes = [], contextInitializerClasses = [], activeProfiles = [], propertySourceDescriptors = [], propertySourceProperties = [], contextCustomizers = [], contextLoader = org.springframework.test.context.support.DelegatingSmartContextLoader, parent = null]
[ERROR] TestThresholdsStoryReconSimulate>AbstractTestNGSpringContextTests.springTestContextPrepareTestInstance:119 » IllegalState ApplicationContext failure threshold (1) exceeded: skipping repeated attempt to load context for [MergedContextConfiguration at 3a3a90c8 testClass = com.evolveum.midpoint.testing.story.TestThresholdsStoryReconSimulate, locations = ["classpath:ctx-story-test-main.xml"], classes = [], contextInitializerClasses = [], activeProfiles = [], propertySourceDescriptors = [], propertySourceProperties = [], contextCustomizers = [], contextLoader = org.springframework.test.context.support.DelegatingSmartContextLoader, parent = null]
[ERROR] TestThresholdsStoryReconSimulateMultithreaded>AbstractTestNGSpringContextTests.springTestContextPrepareTestInstance:119 » IllegalState ApplicationContext failure threshold (1) exceeded: skipping repeated attempt to load context for [MergedContextConfiguration at 597a020b testClass = com.evolveum.midpoint.testing.story.TestThresholdsStoryReconSimulateMultithreaded, locations = ["classpath:ctx-story-test-main.xml"], classes = [], contextInitializerClasses = [], activeProfiles = [], propertySourceDescriptors = [], propertySourceProperties = [], contextCustomizers = [], contextLoader = org.springframework.test.context.support.DelegatingSmartContextLoader, parent = null]
[ERROR] TestTrustedBulkActions>AbstractTestNGSpringContextTests.springTestContextPrepareTestInstance:119 » IllegalState ApplicationContext failure threshold (1) exceeded: skipping repeated attempt to load context for [MergedContextConfiguration at 4d54c7a8 testClass = com.evolveum.midpoint.testing.story.TestTrustedBulkActions, locations = ["classpath:ctx-story-test-main.xml"], classes = [], contextInitializerClasses = [], activeProfiles = [], propertySourceDescriptors = [], propertySourceProperties = [], contextCustomizers = [], contextLoader = org.springframework.test.context.support.DelegatingSmartContextLoader, parent = null]
[ERROR] TestUniversity>AbstractTestNGSpringContextTests.springTestContextPrepareTestInstance:119 » IllegalState ApplicationContext failure threshold (1) exceeded: skipping repeated attempt to load context for [MergedContextConfiguration at 69ceee74 testClass = com.evolveum.midpoint.testing.story.TestUniversity, locations = ["classpath:ctx-story-test-main.xml"], classes = [], contextInitializerClasses = [], activeProfiles = [], propertySourceDescriptors = [], propertySourceProperties = [], contextCustomizers = [], contextLoader = org.springframework.test.context.support.DelegatingSmartContextLoader, parent = null]
[ERROR] TestUnix>AbstractTestNGSpringContextTests.springTestContextPrepareTestInstance:119 » IllegalState ApplicationContext failure threshold (1) exceeded: skipping repeated attempt to load context for [MergedContextConfiguration at 5ee6e818 testClass = com.evolveum.midpoint.testing.story.TestUnix, locations = ["classpath:ctx-story-test-main.xml"], classes = [], contextInitializerClasses = [], activeProfiles = [], propertySourceDescriptors = [], propertySourceProperties = [], contextCustomizers = [], contextLoader = org.springframework.test.context.support.DelegatingSmartContextLoader, parent = null]
[ERROR] TestUnixTolerantAux>AbstractTestNGSpringContextTests.springTestContextPrepareTestInstance:119 » IllegalState ApplicationContext failure threshold (1) exceeded: skipping repeated attempt to load context for [MergedContextConfiguration at 1ca7d371 testClass = com.evolveum.midpoint.testing.story.TestUnixTolerantAux, locations = ["classpath:ctx-story-test-main.xml"], classes = [], contextInitializerClasses = [], activeProfiles = [], propertySourceDescriptors = [], propertySourceProperties = [], contextCustomizers = [], contextLoader = org.springframework.test.context.support.DelegatingSmartContextLoader, parent = null]
[ERROR] TestVeryAuthoritativeSource>AbstractTestNGSpringContextTests.springTestContextPrepareTestInstance:119 » IllegalState ApplicationContext failure threshold (1) exceeded: skipping repeated attempt to load context for [MergedContextConfiguration at 64280fe6 testClass = com.evolveum.midpoint.testing.story.TestVeryAuthoritativeSource, locations = ["classpath:ctx-story-test-main.xml"], classes = [], contextInitializerClasses = [], activeProfiles = [], propertySourceDescriptors = [], propertySourceProperties = [], contextCustomizers = [], contextLoader = org.springframework.test.context.support.DelegatingSmartContextLoader, parent = null]
[ERROR] TestWriter>AbstractTestNGSpringContextTests.springTestContextPrepareTestInstance:119 » IllegalState ApplicationContext failure threshold (1) exceeded: skipping repeated attempt to load context for [MergedContextConfiguration at 76626144 testClass = com.evolveum.midpoint.testing.story.TestWriter, locations = ["classpath:ctx-story-test-main.xml"], classes = [], contextInitializerClasses = [], activeProfiles = [], propertySourceDescriptors = [], propertySourceProperties = [], contextCustomizers = [], contextLoader = org.springframework.test.context.support.DelegatingSmartContextLoader, parent = null]
[ERROR] TestAsyncProvisioning>AbstractTestNGSpringContextTests.springTestContextPrepareTestInstance:119 » IllegalState ApplicationContext failure threshold (1) exceeded: skipping repeated attempt to load context for [MergedContextConfiguration at 68527d52 testClass = com.evolveum.midpoint.testing.story.async.TestAsyncProvisioning, locations = ["classpath:ctx-story-test-main.xml"], classes = [], contextInitializerClasses = [], activeProfiles = [], propertySourceDescriptors = [], propertySourceProperties = [], contextCustomizers = [], contextLoader = org.springframework.test.context.support.DelegatingSmartContextLoader, parent = null]
[ERROR] TestConsistencyMechanism>AbstractTestNGSpringContextTests.springTestContextPrepareTestInstance:119 » IllegalState ApplicationContext failure threshold (1) exceeded: skipping repeated attempt to load context for [MergedContextConfiguration at 71cd3b14 testClass = com.evolveum.midpoint.testing.story.consistency.TestConsistencyMechanism, locations = ["classpath:ctx-story-test-main.xml"], classes = [], contextInitializerClasses = [], activeProfiles = [], propertySourceDescriptors = [], propertySourceProperties = [], contextCustomizers = [], contextLoader = org.springframework.test.context.support.DelegatingSmartContextLoader, parent = null]
[ERROR] TestConsistencyReaper>AbstractTestNGSpringContextTests.springTestContextPrepareTestInstance:119 » IllegalState ApplicationContext failure threshold (1) exceeded: skipping repeated attempt to load context for [MergedContextConfiguration at 45704900 testClass = com.evolveum.midpoint.testing.story.consistency.TestConsistencyReaper, locations = ["classpath:ctx-story-test-main.xml"], classes = [], contextInitializerClasses = [], activeProfiles = [], propertySourceDescriptors = [], propertySourceProperties = [], contextCustomizers = [], contextLoader = org.springframework.test.context.support.DelegatingSmartContextLoader, parent = null]
[ERROR] TestIdMatchCorrelationMediumDummy>AbstractTestNGSpringContextTests.springTestContextPrepareTestInstance:119 » IllegalState ApplicationContext failure threshold (1) exceeded: skipping repeated attempt to load context for [MergedContextConfiguration at 4caa5acb testClass = com.evolveum.midpoint.testing.story.correlation.TestIdMatchCorrelationMediumDummy, locations = ["classpath:ctx-story-test-main.xml"], classes = [], contextInitializerClasses = [], activeProfiles = [], propertySourceDescriptors = [], propertySourceProperties = [], contextCustomizers = [], contextLoader = org.springframework.test.context.support.DelegatingSmartContextLoader, parent = null]
[ERROR] TestIdMatchCorrelationMultiAccountsDummy>AbstractTestNGSpringContextTests.springTestContextPrepareTestInstance:119 » IllegalState ApplicationContext failure threshold (1) exceeded: skipping repeated attempt to load context for [MergedContextConfiguration at 5ea57ec2 testClass = com.evolveum.midpoint.testing.story.correlation.TestIdMatchCorrelationMultiAccountsDummy, locations = ["classpath:ctx-story-test-main.xml"], classes = [], contextInitializerClasses = [], activeProfiles = [], propertySourceDescriptors = [], propertySourceProperties = [], contextCustomizers = [], contextLoader = org.springframework.test.context.support.DelegatingSmartContextLoader, parent = null]
[ERROR] TestIdMatchCorrelationSimpleDummy>AbstractTestNGSpringContextTests.springTestContextPrepareTestInstance:119 » IllegalState ApplicationContext failure threshold (1) exceeded: skipping repeated attempt to load context for [MergedContextConfiguration at 652d0565 testClass = com.evolveum.midpoint.testing.story.correlation.TestIdMatchCorrelationSimpleDummy, locations = ["classpath:ctx-story-test-main.xml"], classes = [], contextInitializerClasses = [], activeProfiles = [], propertySourceDescriptors = [], propertySourceProperties = [], contextCustomizers = [], contextLoader = org.springframework.test.context.support.DelegatingSmartContextLoader, parent = null]
[ERROR] TestInternalCorrelationMedium>AbstractTestNGSpringContextTests.springTestContextPrepareTestInstance:119 » IllegalState ApplicationContext failure threshold (1) exceeded: skipping repeated attempt to load context for [MergedContextConfiguration at 3d7e7167 testClass = com.evolveum.midpoint.testing.story.correlation.TestInternalCorrelationMedium, locations = ["classpath:ctx-story-test-main.xml"], classes = [], contextInitializerClasses = [], activeProfiles = [], propertySourceDescriptors = [], propertySourceProperties = [], contextCustomizers = [], contextLoader = org.springframework.test.context.support.DelegatingSmartContextLoader, parent = null]
[ERROR] TestInternalCorrelationMultiAccounts>AbstractTestNGSpringContextTests.springTestContextPrepareTestInstance:119 » IllegalState ApplicationContext failure threshold (1) exceeded: skipping repeated attempt to load context for [MergedContextConfiguration at 3db6a5ca testClass = com.evolveum.midpoint.testing.story.correlation.TestInternalCorrelationMultiAccounts, locations = ["classpath:ctx-story-test-main.xml"], classes = [], contextInitializerClasses = [], activeProfiles = [], propertySourceDescriptors = [], propertySourceProperties = [], contextCustomizers = [], contextLoader = org.springframework.test.context.support.DelegatingSmartContextLoader, parent = null]
[ERROR] TestInternalCorrelationSimple>AbstractTestNGSpringContextTests.springTestContextPrepareTestInstance:119 » IllegalState ApplicationContext failure threshold (1) exceeded: skipping repeated attempt to load context for [MergedContextConfiguration at 2293c2e8 testClass = com.evolveum.midpoint.testing.story.correlation.TestInternalCorrelationSimple, locations = ["classpath:ctx-story-test-main.xml"], classes = [], contextInitializerClasses = [], activeProfiles = [], propertySourceDescriptors = [], propertySourceProperties = [], contextCustomizers = [], contextLoader = org.springframework.test.context.support.DelegatingSmartContextLoader, parent = null]
[ERROR] TestInternalCorrelationSimpleSimplified>AbstractTestNGSpringContextTests.springTestContextPrepareTestInstance:119 » IllegalState ApplicationContext failure threshold (1) exceeded: skipping repeated attempt to load context for [MergedContextConfiguration at 1d4d8836 testClass = com.evolveum.midpoint.testing.story.correlation.TestInternalCorrelationSimpleSimplified, locations = ["classpath:ctx-story-test-main.xml"], classes = [], contextInitializerClasses = [], activeProfiles = [], propertySourceDescriptors = [], propertySourceProperties = [], contextCustomizers = [], contextLoader = org.springframework.test.context.support.DelegatingSmartContextLoader, parent = null]
[ERROR] TestGrouperAsyncUpdate>AbstractTestNGSpringContextTests.springTestContextPrepareTestInstance:119 » IllegalState ApplicationContext failure threshold (1) exceeded: skipping repeated attempt to load context for [MergedContextConfiguration at 182317b7 testClass = com.evolveum.midpoint.testing.story.grouper.TestGrouperAsyncUpdate, locations = ["classpath:ctx-story-test-main.xml"], classes = [], contextInitializerClasses = [], activeProfiles = [], propertySourceDescriptors = [], propertySourceProperties = [], contextCustomizers = [], contextLoader = org.springframework.test.context.support.DelegatingSmartContextLoader, parent = null]
[ERROR] TestLdapComplex>AbstractTestNGSpringContextTests.springTestContextPrepareTestInstance:119 » IllegalState ApplicationContext failure threshold (1) exceeded: skipping repeated attempt to load context for [MergedContextConfiguration at 574b9c30 testClass = com.evolveum.midpoint.testing.story.ldap.TestLdapComplex, locations = ["classpath:ctx-story-test-main.xml"], classes = [], contextInitializerClasses = [], activeProfiles = [], propertySourceDescriptors = [], propertySourceProperties = [], contextCustomizers = [], contextLoader = org.springframework.test.context.support.DelegatingSmartContextLoader, parent = null]
[ERROR] TestLdapDependency>AbstractTestNGSpringContextTests.springTestContextPrepareTestInstance:119 » IllegalState ApplicationContext failure threshold (1) exceeded: skipping repeated attempt to load context for [MergedContextConfiguration at 3e2375c1 testClass = com.evolveum.midpoint.testing.story.ldap.TestLdapDependency, locations = ["classpath:ctx-story-test-main.xml"], classes = [], contextInitializerClasses = [], activeProfiles = [], propertySourceDescriptors = [], propertySourceProperties = [], contextCustomizers = [], contextLoader = org.springframework.test.context.support.DelegatingSmartContextLoader, parent = null]
[ERROR] TestLdapMutilated>AbstractTestNGSpringContextTests.springTestContextPrepareTestInstance:119 » IllegalState ApplicationContext failure threshold (1) exceeded: skipping repeated attempt to load context for [MergedContextConfiguration at 43c7c34c testClass = com.evolveum.midpoint.testing.story.ldap.TestLdapMutilated, locations = ["classpath:ctx-story-test-main.xml"], classes = [], contextInitializerClasses = [], activeProfiles = [], propertySourceDescriptors = [], propertySourceProperties = [], contextCustomizers = [], contextLoader = org.springframework.test.context.support.DelegatingSmartContextLoader, parent = null]
[ERROR] TestLdapSyncMassive>AbstractTestNGSpringContextTests.springTestContextPrepareTestInstance:119 » IllegalState ApplicationContext failure threshold (1) exceeded: skipping repeated attempt to load context for [MergedContextConfiguration at 4b0e5db5 testClass = com.evolveum.midpoint.testing.story.ldap.TestLdapSyncMassive, locations = ["classpath:ctx-story-test-main.xml"], classes = [], contextInitializerClasses = [], activeProfiles = [], propertySourceDescriptors = [], propertySourceProperties = [], contextCustomizers = [], contextLoader = org.springframework.test.context.support.DelegatingSmartContextLoader, parent = null]
[ERROR] TestLdapVirtualGroup>AbstractTestNGSpringContextTests.springTestContextPrepareTestInstance:119 » IllegalState ApplicationContext failure threshold (1) exceeded: skipping repeated attempt to load context for [MergedContextConfiguration at 3ebc45fc testClass = com.evolveum.midpoint.testing.story.ldap.TestLdapVirtualGroup, locations = ["classpath:ctx-story-test-main.xml"], classes = [], contextInitializerClasses = [], activeProfiles = [], propertySourceDescriptors = [], propertySourceProperties = [], contextCustomizers = [], contextLoader = org.springframework.test.context.support.DelegatingSmartContextLoader, parent = null]
[ERROR] TestLdapDeeplyHierarchical>AbstractTestNGSpringContextTests.springTestContextPrepareTestInstance:119 » IllegalState ApplicationContext failure threshold (1) exceeded: skipping repeated attempt to load context for [MergedContextConfiguration at 19da7b2d testClass = com.evolveum.midpoint.testing.story.ldap.hierarchy.TestLdapDeeplyHierarchical, locations = ["classpath:ctx-story-test-main.xml"], classes = [], contextInitializerClasses = [], activeProfiles = [], propertySourceDescriptors = [], propertySourceProperties = [], contextCustomizers = [], contextLoader = org.springframework.test.context.support.DelegatingSmartContextLoader, parent = null]
[ERROR] TestLdapFlat>AbstractTestNGSpringContextTests.springTestContextPrepareTestInstance:119 » IllegalState ApplicationContext failure threshold (1) exceeded: skipping repeated attempt to load context for [MergedContextConfiguration at 52b0f4a0 testClass = com.evolveum.midpoint.testing.story.ldap.hierarchy.TestLdapFlat, locations = ["classpath:ctx-story-test-main.xml"], classes = [], contextInitializerClasses = [], activeProfiles = [], propertySourceDescriptors = [], propertySourceProperties = [], contextCustomizers = [], contextLoader = org.springframework.test.context.support.DelegatingSmartContextLoader, parent = null]
[ERROR] TestLdapHierarchical>AbstractTestNGSpringContextTests.springTestContextPrepareTestInstance:119 » IllegalState ApplicationContext failure threshold (1) exceeded: skipping repeated attempt to load context for [MergedContextConfiguration at 3fd7de34 testClass = com.evolveum.midpoint.testing.story.ldap.hierarchy.TestLdapHierarchical, locations = ["classpath:ctx-story-test-main.xml"], classes = [], contextInitializerClasses = [], activeProfiles = [], propertySourceDescriptors = [], propertySourceProperties = [], contextCustomizers = [], contextLoader = org.springframework.test.context.support.DelegatingSmartContextLoader, parent = null]
[ERROR] TestLdapNested>AbstractTestNGSpringContextTests.springTestContextPrepareTestInstance:119 » IllegalState ApplicationContext failure threshold (1) exceeded: skipping repeated attempt to load context for [MergedContextConfiguration at 3befa456 testClass = com.evolveum.midpoint.testing.story.ldap.hierarchy.TestLdapNested, locations = ["classpath:ctx-story-test-main.xml"], classes = [], contextInitializerClasses = [], activeProfiles = [], propertySourceDescriptors = [], propertySourceProperties = [], contextCustomizers = [], contextLoader = org.springframework.test.context.support.DelegatingSmartContextLoader, parent = null]
[ERROR] TestNotoriousOrg>AbstractTestNGSpringContextTests.springTestContextPrepareTestInstance:119 » IllegalState ApplicationContext failure threshold (1) exceeded: skipping repeated attempt to load context for [MergedContextConfiguration at 7aee6380 testClass = com.evolveum.midpoint.testing.story.notorious.TestNotoriousOrg, locations = ["classpath:ctx-story-test-main.xml"], classes = [], contextInitializerClasses = [], activeProfiles = [], propertySourceDescriptors = [], propertySourceProperties = [], contextCustomizers = [], contextLoader = org.springframework.test.context.support.DelegatingSmartContextLoader, parent = null]
[ERROR] TestNotoriousRole>AbstractTestNGSpringContextTests.springTestContextPrepareTestInstance:119 » IllegalState ApplicationContext failure threshold (1) exceeded: skipping repeated attempt to load context for [MergedContextConfiguration at 70bec2e0 testClass = com.evolveum.midpoint.testing.story.notorious.TestNotoriousRole, locations = ["classpath:ctx-story-test-main.xml"], classes = [], contextInitializerClasses = [], activeProfiles = [], propertySourceDescriptors = [], propertySourceProperties = [], contextCustomizers = [], contextLoader = org.springframework.test.context.support.DelegatingSmartContextLoader, parent = null]
[ERROR] TestPrivacy>AbstractTestNGSpringContextTests.springTestContextPrepareTestInstance:119 » IllegalState ApplicationContext failure threshold (1) exceeded: skipping repeated attempt to load context for [MergedContextConfiguration at 321f5619 testClass = com.evolveum.midpoint.testing.story.security.TestPrivacy, locations = ["classpath:ctx-story-test-main.xml"], classes = [], contextInitializerClasses = [], activeProfiles = [], propertySourceDescriptors = [], propertySourceProperties = [], contextCustomizers = [], contextLoader = org.springframework.test.context.support.DelegatingSmartContextLoader, parent = null]
[ERROR] TestRoleMembers>AbstractTestNGSpringContextTests.springTestContextPrepareTestInstance:119 » IllegalState ApplicationContext failure threshold (1) exceeded: skipping repeated attempt to load context for [MergedContextConfiguration at 45269f54 testClass = com.evolveum.midpoint.testing.story.security.TestRoleMembers, locations = ["classpath:ctx-story-test-main.xml"], classes = [], contextInitializerClasses = [], activeProfiles = [], propertySourceDescriptors = [], propertySourceProperties = [], contextCustomizers = [], contextLoader = org.springframework.test.context.support.DelegatingSmartContextLoader, parent = null]
[ERROR] TestUuidClient>AbstractTestNGSpringContextTests.springTestContextPrepareTestInstance:119 » IllegalState ApplicationContext failure threshold (1) exceeded: skipping repeated attempt to load context for [MergedContextConfiguration at e38f6fc testClass = com.evolveum.midpoint.testing.story.uuid.TestUuidClient, locations = ["classpath:ctx-story-test-main.xml"], classes = [], contextInitializerClasses = [], activeProfiles = [], propertySourceDescriptors = [], propertySourceProperties = [], contextCustomizers = [], contextLoader = org.springframework.test.context.support.DelegatingSmartContextLoader, parent = null]
[ERROR] TestUuidExtension>AbstractTestNGSpringContextTests.springTestContextPrepareTestInstance:119 » IllegalState ApplicationContext failure threshold (1) exceeded: skipping repeated attempt to load context for [MergedContextConfiguration at 2f4c0b42 testClass = com.evolveum.midpoint.testing.story.uuid.TestUuidExtension, locations = ["classpath:ctx-story-test-main.xml"], classes = [], contextInitializerClasses = [], activeProfiles = [], propertySourceDescriptors = [], propertySourceProperties = [], contextCustomizers = [], contextLoader = org.springframework.test.context.support.DelegatingSmartContextLoader, parent = null]
[INFO]
[ERROR] Tests run: 1531, Failures: 68, Errors: 0, Skipped: 1463
[INFO]
[INFO]
[INFO] --- failsafe:3.1.2:verify (integration-test) @ story ---
[ERROR] There are test failures.
Please refer to /home/jenkins/agent/workspace/midpoint-support-4-8-native-pg16-jdk21/testing/story/target/failsafe-reports for the individual test results.
Please refer to dump files (if any exist) [date].dump, [date]-jvmRun[N].dump and [date].dumpstream.
[INFO]
[INFO] --- dependency:3.3.0:analyze-only (analyze) @ story ---
[INFO] No dependency problems found
[INFO]
[INFO] -----------------< com.evolveum.midpoint.testing:rest >-----------------
[INFO] Building midPoint Testing - REST API 4.8.6-SNAPSHOT [5/5]
[INFO] from rest/pom.xml
[INFO] --------------------------------[ jar ]---------------------------------
[INFO]
[INFO] --- enforcer:3.4.1:enforce (enforce) @ rest ---
[INFO] Rule 1: org.apache.maven.enforcer.rules.dependency.DependencyConvergence passed
[INFO] Rule 2: org.apache.maven.enforcer.rules.dependency.BannedDependencies passed
[INFO]
[INFO] --- checkstyle:3.1.2:check (validate) @ rest ---
[INFO] Starting audit...
Audit done.
[INFO] You have 0 Checkstyle violations.
[INFO]
[INFO] --- gitdescribe:3.0:gitdescribe (git-describe) @ rest ---
[INFO] Setting Git Describe: v4.8.6devel-68-g371bca571fc
[INFO]
[INFO] --- resources:3.1.0:resources (default-resources) @ rest ---
[INFO] Using 'UTF-8' encoding to copy filtered resources.
[INFO] skip non existing resourceDirectory /home/jenkins/agent/workspace/midpoint-support-4-8-native-pg16-jdk21/testing/rest/src/main/resources
[INFO]
[INFO] --- compiler:3.11.0:compile (default-compile) @ rest ---
[INFO] No sources to compile
[INFO]
[INFO] --- resources:3.1.0:testResources (default-testResources) @ rest ---
[INFO] Using 'UTF-8' encoding to copy filtered resources.
[INFO] Copying 145 resources
[INFO]
[INFO] --- compiler:3.11.0:testCompile (default-testCompile) @ rest ---
[INFO] Nothing to compile - all classes are up to date
[INFO]
[INFO] --- surefire:3.1.2:test (default-test) @ rest ---
[INFO] Tests are skipped.
[INFO]
[INFO] --- jar:3.4.2:jar (default-jar) @ rest ---
[INFO] Skipping packaging of the jar
[INFO]
[INFO] >>> source:3.1.0:jar (attach-sources) > generate-sources @ rest >>>
[INFO]
[INFO] --- enforcer:3.4.1:enforce (enforce) @ rest ---
[INFO] Rule 1: org.apache.maven.enforcer.rules.dependency.DependencyConvergence passed
[INFO] Rule 2: org.apache.maven.enforcer.rules.dependency.BannedDependencies passed
[INFO]
[INFO] --- checkstyle:3.1.2:check (validate) @ rest ---
[INFO] Starting audit...
Audit done.
[INFO] You have 0 Checkstyle violations.
[INFO]
[INFO] --- gitdescribe:3.0:gitdescribe (git-describe) @ rest ---
[INFO]
[INFO] <<< source:3.1.0:jar (attach-sources) < generate-sources @ rest <<<
[INFO]
[INFO]
[INFO] --- source:3.1.0:jar (attach-sources) @ rest ---
[INFO] No sources in project. Archive not created.
[INFO]
[INFO] --- failsafe:3.1.2:integration-test (integration-test) @ rest ---
[INFO] Using configured provider org.apache.maven.surefire.testng.TestNGProvider
[INFO]
[INFO] -------------------------------------------------------
[INFO] T E S T S
[INFO] -------------------------------------------------------
[INFO] Running Integration
[INFO] Tests run: 271, Failures: 0, Errors: 0, Skipped: 0, Time elapsed: 206.9 s -- in Integration
[INFO]
[INFO] Results:
[INFO]
[INFO] Tests run: 271, Failures: 0, Errors: 0, Skipped: 0
[INFO]
[INFO]
[INFO] --- failsafe:3.1.2:verify (integration-test) @ rest ---
[INFO]
[INFO] --- dependency:3.3.0:analyze-only (analyze) @ rest ---
[INFO] No dependency problems found
[INFO] ------------------------------------------------------------------------
[INFO] Reactor Summary for midPoint Testing Infrastructure 4.8.6-SNAPSHOT:
[INFO]
[INFO] midPoint Testing Infrastructure .................... SUCCESS [ 2.271 s]
[INFO] midPoint Testing - Resource Connection Tests ....... SUCCESS [ 3.696 s]
[INFO] midPoint Testing - Long Tests ...................... SUCCESS [ 16.876 s]
[INFO] midPoint Testing - Story Tests ..................... SUCCESS [ 26.271 s]
[INFO] midPoint Testing - REST API ........................ SUCCESS [03:29 min]
[INFO] ------------------------------------------------------------------------
[INFO] BUILD SUCCESS
[INFO] ------------------------------------------------------------------------
[INFO] Total time: 04:19 min
[INFO] Finished at: 2025-01-10T06:33:17Z
[INFO] ------------------------------------------------------------------------
+ '[' 0 -ge 1 ']'
[Pipeline] }
[Pipeline] // container
[Pipeline] }
[Pipeline] // stage
[Pipeline] stage
[Pipeline] { (collect-test-results)
[Pipeline] container
[Pipeline] {
[Pipeline] testNG
TestNG Reports Processing: START
Looking for TestNG results report in workspace using pattern: **/testng-results.xml
Saving reports...
Processing '/var/jenkins_home/jobs/midpoint-support-4-8-native-pg16-jdk21/builds/201/testng/testng-results-1.xml'
Processing '/var/jenkins_home/jobs/midpoint-support-4-8-native-pg16-jdk21/builds/201/testng/testng-results-10.xml'
Processing '/var/jenkins_home/jobs/midpoint-support-4-8-native-pg16-jdk21/builds/201/testng/testng-results-11.xml'
Processing '/var/jenkins_home/jobs/midpoint-support-4-8-native-pg16-jdk21/builds/201/testng/testng-results-12.xml'
Processing '/var/jenkins_home/jobs/midpoint-support-4-8-native-pg16-jdk21/builds/201/testng/testng-results-13.xml'
Processing '/var/jenkins_home/jobs/midpoint-support-4-8-native-pg16-jdk21/builds/201/testng/testng-results-14.xml'
Processing '/var/jenkins_home/jobs/midpoint-support-4-8-native-pg16-jdk21/builds/201/testng/testng-results-15.xml'
Processing '/var/jenkins_home/jobs/midpoint-support-4-8-native-pg16-jdk21/builds/201/testng/testng-results-16.xml'
Processing '/var/jenkins_home/jobs/midpoint-support-4-8-native-pg16-jdk21/builds/201/testng/testng-results-17.xml'
Processing '/var/jenkins_home/jobs/midpoint-support-4-8-native-pg16-jdk21/builds/201/testng/testng-results-18.xml'
Processing '/var/jenkins_home/jobs/midpoint-support-4-8-native-pg16-jdk21/builds/201/testng/testng-results-19.xml'
Processing '/var/jenkins_home/jobs/midpoint-support-4-8-native-pg16-jdk21/builds/201/testng/testng-results-2.xml'
Processing '/var/jenkins_home/jobs/midpoint-support-4-8-native-pg16-jdk21/builds/201/testng/testng-results-20.xml'
Processing '/var/jenkins_home/jobs/midpoint-support-4-8-native-pg16-jdk21/builds/201/testng/testng-results-21.xml'
Processing '/var/jenkins_home/jobs/midpoint-support-4-8-native-pg16-jdk21/builds/201/testng/testng-results-22.xml'
Processing '/var/jenkins_home/jobs/midpoint-support-4-8-native-pg16-jdk21/builds/201/testng/testng-results-23.xml'
Processing '/var/jenkins_home/jobs/midpoint-support-4-8-native-pg16-jdk21/builds/201/testng/testng-results-24.xml'
Processing '/var/jenkins_home/jobs/midpoint-support-4-8-native-pg16-jdk21/builds/201/testng/testng-results-25.xml'
Processing '/var/jenkins_home/jobs/midpoint-support-4-8-native-pg16-jdk21/builds/201/testng/testng-results-26.xml'
Processing '/var/jenkins_home/jobs/midpoint-support-4-8-native-pg16-jdk21/builds/201/testng/testng-results-27.xml'
Processing '/var/jenkins_home/jobs/midpoint-support-4-8-native-pg16-jdk21/builds/201/testng/testng-results-28.xml'
Processing '/var/jenkins_home/jobs/midpoint-support-4-8-native-pg16-jdk21/builds/201/testng/testng-results-29.xml'
Processing '/var/jenkins_home/jobs/midpoint-support-4-8-native-pg16-jdk21/builds/201/testng/testng-results-3.xml'
Processing '/var/jenkins_home/jobs/midpoint-support-4-8-native-pg16-jdk21/builds/201/testng/testng-results-30.xml'
Processing '/var/jenkins_home/jobs/midpoint-support-4-8-native-pg16-jdk21/builds/201/testng/testng-results-31.xml'
Processing '/var/jenkins_home/jobs/midpoint-support-4-8-native-pg16-jdk21/builds/201/testng/testng-results-32.xml'
Processing '/var/jenkins_home/jobs/midpoint-support-4-8-native-pg16-jdk21/builds/201/testng/testng-results-33.xml'
Processing '/var/jenkins_home/jobs/midpoint-support-4-8-native-pg16-jdk21/builds/201/testng/testng-results-34.xml'
Processing '/var/jenkins_home/jobs/midpoint-support-4-8-native-pg16-jdk21/builds/201/testng/testng-results-4.xml'
Processing '/var/jenkins_home/jobs/midpoint-support-4-8-native-pg16-jdk21/builds/201/testng/testng-results-5.xml'
Processing '/var/jenkins_home/jobs/midpoint-support-4-8-native-pg16-jdk21/builds/201/testng/testng-results-6.xml'
Processing '/var/jenkins_home/jobs/midpoint-support-4-8-native-pg16-jdk21/builds/201/testng/testng-results-7.xml'
Processing '/var/jenkins_home/jobs/midpoint-support-4-8-native-pg16-jdk21/builds/201/testng/testng-results-8.xml'
Processing '/var/jenkins_home/jobs/midpoint-support-4-8-native-pg16-jdk21/builds/201/testng/testng-results-9.xml'
Processing '/var/jenkins_home/jobs/midpoint-support-4-8-native-pg16-jdk21/builds/201/testng/testng-results.xml'
Failed configuration methods found. Marking build as FAILURE.
TestNG Reports Processing: FINISH
[Pipeline] }
[Pipeline] // container
[Pipeline] }
[Pipeline] // stage
[Pipeline] step
More information about the midPoint-ci
mailing list