[midPoint-ci] Build failed in Jenkins: midPoint - master - main - PG 16 #357

Jenkins noreply at evolveum.com
Wed Feb 19 17:41:37 CET 2025


See <https://jenkins.evolveum.com/job/midpoint-master-main/357/display/redirect>

Changes:


------------------------------------------
[...truncated 5592 lines...]
[INFO] 
[INFO] --- gitdescribe-maven-plugin:3.0:gitdescribe (git-describe) @ custom ---
[INFO] Setting Git Describe: v4.10devel-943-g32202159068
[INFO] 
[INFO] >>> maven-source-plugin:3.1.0:jar (attach-sources) > generate-sources @ custom >>>
[INFO] 
[INFO] --- maven-enforcer-plugin:3.5.0:enforce (enforce) @ custom ---
[INFO] Rule 1: org.apache.maven.enforcer.rules.dependency.DependencyConvergence passed
[INFO] Rule 2: org.apache.maven.enforcer.rules.dependency.BannedDependencies passed
[INFO] 
[INFO] --- maven-checkstyle-plugin:3.1.2:check (validate) @ custom ---
[INFO] Starting audit...
Audit done.
[INFO] You have 0 Checkstyle violations.
[INFO] 
[INFO] --- gitdescribe-maven-plugin:3.0:gitdescribe (git-describe) @ custom ---
[INFO] 
[INFO] <<< maven-source-plugin:3.1.0:jar (attach-sources) < generate-sources @ custom <<<
[INFO] 
[INFO] 
[INFO] --- maven-source-plugin:3.1.0:jar (attach-sources) @ custom ---
[INFO] 
[INFO] --- cyclonedx-maven-plugin:2.9.1:makeBom (sbom-package) @ custom ---
[INFO] CycloneDX: Resolving Dependencies
[WARNING] com.evolveum.prism.tools:tools:4.10-SNAPSHOT/maven-metadata.xmlfailed to transfer from http://0.0.0.0/ during a previous attempt. This failure was cached in the local repository and resolution will not be reattempted until the update interval of maven-default-http-blocker has elapsed or updates are forced. Original error: Could not transfer metadata com.evolveum.prism.tools:tools:4.10-SNAPSHOT/maven-metadata.xml from/to maven-default-http-blocker (http://0.0.0.0/): transfer failed for http://0.0.0.0/com/evolveum/prism/tools/tools/4.10-SNAPSHOT/maven-metadata.xml
[WARNING] com.evolveum.prism.tools:tools:4.10-SNAPSHOT/maven-metadata.xmlfailed to transfer from https://snapshots.terracotta.org/ during a previous attempt. This failure was cached in the local repository and resolution will not be reattempted until the update interval of terracotta-snapshots has elapsed or updates are forced. Original error: Could not transfer metadata com.evolveum.prism.tools:tools:4.10-SNAPSHOT/maven-metadata.xml from/to terracotta-snapshots (https://snapshots.terracotta.org/): authorization failed for https://snapshots.terracotta.org/com/evolveum/prism/tools/tools/4.10-SNAPSHOT/maven-metadata.xml, status: 403 Forbidden
[WARNING] com.evolveum.prism:prism-parent:4.10-SNAPSHOT/maven-metadata.xmlfailed to transfer from http://0.0.0.0/ during a previous attempt. This failure was cached in the local repository and resolution will not be reattempted until the update interval of maven-default-http-blocker has elapsed or updates are forced. Original error: Could not transfer metadata com.evolveum.prism:prism-parent:4.10-SNAPSHOT/maven-metadata.xml from/to maven-default-http-blocker (http://0.0.0.0/): transfer failed for http://0.0.0.0/com/evolveum/prism/prism-parent/4.10-SNAPSHOT/maven-metadata.xml
[WARNING] com.evolveum.prism:prism-parent:4.10-SNAPSHOT/maven-metadata.xmlfailed to transfer from https://snapshots.terracotta.org/ during a previous attempt. This failure was cached in the local repository and resolution will not be reattempted until the update interval of terracotta-snapshots has elapsed or updates are forced. Original error: Could not transfer metadata com.evolveum.prism:prism-parent:4.10-SNAPSHOT/maven-metadata.xml from/to terracotta-snapshots (https://snapshots.terracotta.org/): authorization failed for https://snapshots.terracotta.org/com/evolveum/prism/prism-parent/4.10-SNAPSHOT/maven-metadata.xml, status: 403 Forbidden
[INFO] CycloneDX: Creating BOM version 1.6 with 0 component(s)
[INFO] CycloneDX: Writing and validating BOM (XML): /home/jenkins/agent/workspace/midpoint-master-main/custom/target/bom.xml
[INFO]            attaching as custom-4.10-SNAPSHOT-cyclonedx.xml
[INFO] CycloneDX: Writing and validating BOM (JSON): /home/jenkins/agent/workspace/midpoint-master-main/custom/target/bom.json
[INFO]            attaching as custom-4.10-SNAPSHOT-cyclonedx.json
[INFO] 
[INFO] --- maven-failsafe-plugin:3.1.2:integration-test (integration-test) @ custom ---
[INFO] Tests are skipped.
[INFO] 
[INFO] --- maven-failsafe-plugin:3.1.2:verify (integration-test) @ custom ---
[INFO] Tests are skipped.
[INFO] 
[INFO] --- maven-dependency-plugin:3.3.0:analyze-only (analyze) @ custom ---
[INFO] Skipping pom project
[INFO] 
[INFO] --- maven-install-plugin:3.1.3:install (default-install) @ custom ---
[INFO] Installing /home/jenkins/agent/workspace/midpoint-master-main/custom/pom.xml to /root/.m2/repository/com/evolveum/midpoint/custom/4.10-SNAPSHOT/custom-4.10-SNAPSHOT.pom
[INFO] Installing /home/jenkins/agent/workspace/midpoint-master-main/custom/target/bom.xml to /root/.m2/repository/com/evolveum/midpoint/custom/4.10-SNAPSHOT/custom-4.10-SNAPSHOT-cyclonedx.xml
[INFO] Installing /home/jenkins/agent/workspace/midpoint-master-main/custom/target/bom.json to /root/.m2/repository/com/evolveum/midpoint/custom/4.10-SNAPSHOT/custom-4.10-SNAPSHOT-cyclonedx.json
[INFO] 
[INFO] --- maven-deploy-plugin:2.8.2:deploy (default-deploy) @ custom ---
[INFO] Deploying com.evolveum.midpoint:custom:4.10-SNAPSHOT at end
[INFO] 
[INFO] -------------------< com.evolveum.midpoint.gui:gui >--------------------
[INFO] Building midPoint User Interface 4.10-SNAPSHOT                   [58/65]
[INFO] --------------------------------[ pom ]---------------------------------
[INFO] 
[INFO] --- maven-clean-plugin:3.4.0:clean (default-clean) @ gui ---
[INFO] 
[INFO] --- maven-enforcer-plugin:3.5.0:enforce (enforce) @ gui ---
[INFO] Rule 1: org.apache.maven.enforcer.rules.dependency.DependencyConvergence passed
[INFO] Rule 2: org.apache.maven.enforcer.rules.dependency.BannedDependencies passed
[INFO] 
[INFO] --- maven-checkstyle-plugin:3.1.2:check (validate) @ gui ---
[INFO] Starting audit...
Audit done.
[INFO] You have 0 Checkstyle violations.
[INFO] 
[INFO] --- gitdescribe-maven-plugin:3.0:gitdescribe (git-describe) @ gui ---
[INFO] Setting Git Describe: v4.10devel-943-g32202159068
[INFO] 
[INFO] >>> maven-source-plugin:3.1.0:jar (attach-sources) > generate-sources @ gui >>>
[INFO] 
[INFO] --- maven-enforcer-plugin:3.5.0:enforce (enforce) @ gui ---
[INFO] Rule 1: org.apache.maven.enforcer.rules.dependency.DependencyConvergence passed
[INFO] Rule 2: org.apache.maven.enforcer.rules.dependency.BannedDependencies passed
[INFO] 
[INFO] --- maven-checkstyle-plugin:3.1.2:check (validate) @ gui ---
[INFO] Starting audit...
Audit done.
[INFO] You have 0 Checkstyle violations.
[INFO] 
[INFO] --- gitdescribe-maven-plugin:3.0:gitdescribe (git-describe) @ gui ---
[INFO] 
[INFO] <<< maven-source-plugin:3.1.0:jar (attach-sources) < generate-sources @ gui <<<
[INFO] 
[INFO] 
[INFO] --- maven-source-plugin:3.1.0:jar (attach-sources) @ gui ---
[INFO] 
[INFO] --- cyclonedx-maven-plugin:2.9.1:makeBom (sbom-package) @ gui ---
[INFO] CycloneDX: Resolving Dependencies
[INFO] CycloneDX: Creating BOM version 1.6 with 0 component(s)
[INFO] CycloneDX: Writing and validating BOM (XML): /home/jenkins/agent/workspace/midpoint-master-main/gui/target/bom.xml
[INFO]            attaching as gui-4.10-SNAPSHOT-cyclonedx.xml
[INFO] CycloneDX: Writing and validating BOM (JSON): /home/jenkins/agent/workspace/midpoint-master-main/gui/target/bom.json
[INFO]            attaching as gui-4.10-SNAPSHOT-cyclonedx.json
[INFO] 
[INFO] --- maven-dependency-plugin:3.3.0:analyze-only (analyze) @ gui ---
[INFO] Skipping pom project
[INFO] 
[INFO] --- maven-install-plugin:3.1.3:install (default-install) @ gui ---
[INFO] Installing /home/jenkins/agent/workspace/midpoint-master-main/gui/pom.xml to /root/.m2/repository/com/evolveum/midpoint/gui/gui/4.10-SNAPSHOT/gui-4.10-SNAPSHOT.pom
[INFO] Installing /home/jenkins/agent/workspace/midpoint-master-main/gui/target/bom.xml to /root/.m2/repository/com/evolveum/midpoint/gui/gui/4.10-SNAPSHOT/gui-4.10-SNAPSHOT-cyclonedx.xml
[INFO] Installing /home/jenkins/agent/workspace/midpoint-master-main/gui/target/bom.json to /root/.m2/repository/com/evolveum/midpoint/gui/gui/4.10-SNAPSHOT/gui-4.10-SNAPSHOT-cyclonedx.json
[INFO] 
[INFO] --- maven-deploy-plugin:2.8.2:deploy (default-deploy) @ gui ---
[INFO] Deploying com.evolveum.midpoint.gui:gui:4.10-SNAPSHOT at end
[INFO] 
[INFO] ----------------< com.evolveum.midpoint.gui:admin-gui >-----------------
[INFO] Building midPoint User Interface - admin web gui 4.10-SNAPSHOT   [59/65]
[INFO] --------------------------------[ jar ]---------------------------------
[INFO] 
[INFO] --- maven-clean-plugin:3.4.0:clean (default-clean) @ admin-gui ---
[INFO] 
[INFO] --- maven-enforcer-plugin:3.5.0:enforce (enforce) @ admin-gui ---
[INFO] Rule 1: org.apache.maven.enforcer.rules.dependency.DependencyConvergence passed
[INFO] Rule 2: org.apache.maven.enforcer.rules.dependency.BannedDependencies passed
[INFO] 
[INFO] --- maven-checkstyle-plugin:3.1.2:check (validate) @ admin-gui ---
[INFO] Starting audit...
Audit done.
[INFO] You have 0 Checkstyle violations.
[INFO] 
[INFO] --- gitdescribe-maven-plugin:3.0:gitdescribe (git-describe) @ admin-gui ---
[INFO] Setting Git Describe: v4.10devel-943-g32202159068
[INFO] 
[INFO] --- git-commit-id-plugin:4.9.10:revision (default) @ admin-gui ---
[INFO] 
[INFO] --- frontend-maven-plugin:1.15.1:install-node-and-npm (install node and npm) @ admin-gui ---
[INFO] Installing node version v22.14.0
[INFO] Downloading https://nexus.evolveum.com/nexus/repository/nodejs-dist/v22.14.0/node-v22.14.0-linux-x64.tar.gz to /root/.m2/repository/com/github/eirslett/node/22.14.0/node-22.14.0-linux-x64.tar.gz
[INFO] No proxies configured
[INFO] No proxy was configured, downloading directly
[INFO] Unpacking /root/.m2/repository/com/github/eirslett/node/22.14.0/node-22.14.0-linux-x64.tar.gz into /home/jenkins/agent/workspace/midpoint-master-main/gui/admin-gui/target/node/tmp
[INFO] Copying node binary from /home/jenkins/agent/workspace/midpoint-master-main/gui/admin-gui/target/node/tmp/node-v22.14.0-linux-x64/bin/node to /home/jenkins/agent/workspace/midpoint-master-main/gui/admin-gui/target/node/node
[INFO] Installed node locally.
[INFO] Installing npm version 11.1.0
[INFO] Downloading https://nexus.evolveum.com/nexus/repository/npmjs-dist/npm-11.1.0.tgz to /root/.m2/repository/com/github/eirslett/npm/11.1.0/npm-11.1.0.tar.gz
[INFO] No proxies configured
[INFO] No proxy was configured, downloading directly
[INFO] Unpacking /root/.m2/repository/com/github/eirslett/npm/11.1.0/npm-11.1.0.tar.gz into /home/jenkins/agent/workspace/midpoint-master-main/gui/admin-gui/target/node/node_modules
[INFO] Installed npm locally.
[INFO] 
[INFO] --- frontend-maven-plugin:1.15.1:npm (npm ignore certs) @ admin-gui ---
[INFO] Running 'npm config set strict-ssl false' in /home/jenkins/agent/workspace/midpoint-master-main/gui/admin-gui
[INFO] 
[INFO] --- frontend-maven-plugin:1.15.1:npm (npm install) @ admin-gui ---
[INFO] Running 'npm install' in /home/jenkins/agent/workspace/midpoint-master-main/gui/admin-gui
[INFO] npm warn deprecated bootstrap-colorpicker at 3.4.0: Package no longer supported. Contact Support at https://www.npmjs.com/support for more info.
[INFO] npm warn deprecated popper.js at 1.16.1: You can find the new Popper v2 at @popperjs/core, this package is dedicated to the legacy v1
[INFO] npm warn deprecated flag-icon-css at 4.1.7: The project has been renamed to flag-icons
[INFO] npm error code E404
[INFO] npm error 404 Not Found - GET https://nexus.evolveum.com/nexus/repository/npm/postcss/-/postcss-8.5.3.tgz
[INFO] npm error 404
[INFO] npm error 404  'postcss at https://nexus.evolveum.com/nexus/repository/npm/postcss/-/postcss-8.5.3.tgz' is not in this registry.
[INFO] npm error 404
[INFO] npm error 404 Note that you can also install from a
[INFO] npm error 404 tarball, folder, http url, or git url.
[INFO] npm error A complete log of this run can be found in: /root/.npm/_logs/2025-02-19T16_41_20_310Z-debug-0.log
[INFO] ------------------------------------------------------------------------
[INFO] Reactor Summary for midPoint Project 4.10-SNAPSHOT:
[INFO] 
[INFO] midPoint Project ................................... SUCCESS [ 23.851 s]
[INFO] midPoint Infrastructure ............................ SUCCESS [  0.378 s]
[INFO] midPoint Infrastructure - schema ................... SUCCESS [01:47 min]
[INFO] midPoint Repository ................................ SUCCESS [  0.200 s]
[INFO] midPoint Repository - api .......................... SUCCESS [  2.116 s]
[INFO] midPoint Task Manager - api ........................ SUCCESS [  2.976 s]
[INFO] midPoint Infrastructure - testing utils (lvl 2) .... SUCCESS [ 11.734 s]
[INFO] midPoint Infrastructure - common ................... SUCCESS [  5.449 s]
[INFO] midPoint Audit - api ............................... SUCCESS [  2.173 s]
[INFO] midPoint Security - api ............................ SUCCESS [  2.387 s]
[INFO] midPoint Repository - SQL common support ........... SUCCESS [  3.270 s]
[INFO] midPoint Repository - sql repository ............... SUCCESS [  8.546 s]
[INFO] midPoint System Initialization ..................... SUCCESS [ 28.941 s]
[INFO] midPoint Repository - new SQL repository ........... SUCCESS [ 13.665 s]
[INFO] midPoint Repository - sql repository test .......... SUCCESS [  9.425 s]
[INFO] midPoint Repository Cache .......................... SUCCESS [  6.881 s]
[INFO] midPoint Audit - logging impl ...................... SUCCESS [  2.044 s]
[INFO] midPoint Icf Connectors ............................ SUCCESS [  0.171 s]
[INFO] Dummy Resource ..................................... SUCCESS [  3.766 s]
[INFO] midPoint Repository - test utils ................... SUCCESS [  8.793 s]
[INFO] midPoint Security - impl ........................... SUCCESS [  5.961 s]
[INFO] midPoint Task Manager - Quartz impl ................ SUCCESS [  8.699 s]
[INFO] midPoint Tools ..................................... SUCCESS [  0.202 s]
[INFO] midPoint Tools - Ninja ............................. SUCCESS [ 25.799 s]
[INFO] midPoint Tools - custom Spring Boot JAR layout ..... SUCCESS [  0.522 s]
[INFO] midPoint Infrastructure - pure JAXB schema ......... SUCCESS [ 11.638 s]
[INFO] midPoint Repo Commons .............................. SUCCESS [  9.855 s]
[INFO] midPoint Security Enforcer - api ................... SUCCESS [  2.389 s]
[INFO] midPoint Security Enforcer - impl .................. SUCCESS [  3.055 s]
[INFO] midPoint Provisioning .............................. SUCCESS [  0.167 s]
[INFO] midPoint Provisioning - api ........................ SUCCESS [  2.426 s]
[INFO] Unified Connector Framework - api .................. SUCCESS [  2.518 s]
[INFO] Dummy Connector .................................... SUCCESS [  1.264 s]
[INFO] Unified Connector Framework - ConnId impl .......... SUCCESS [  8.415 s]
[INFO] Unified Connector Framework - Built-in impl ........ SUCCESS [  8.295 s]
[INFO] midPoint Provisioning - impl ....................... SUCCESS [ 13.110 s]
[INFO] midPoint Model ..................................... SUCCESS [  0.170 s]
[INFO] midPoint Model - api ............................... SUCCESS [  3.427 s]
[INFO] midPoint Model - common ............................ SUCCESS [ 11.225 s]
[INFO] midPoint Notifications - api ....................... SUCCESS [  2.924 s]
[INFO] Dummy Connector Fake ............................... SUCCESS [  0.244 s]
[INFO] midPoint Authentication - api ...................... SUCCESS [  2.714 s]
[INFO] midPoint Model - test .............................. SUCCESS [  9.337 s]
[INFO] midPoint Report - api .............................. SUCCESS [  2.055 s]
[INFO] midPoint Cases - api ............................... SUCCESS [  2.335 s]
[INFO] midPoint Access Certification - api ................ SUCCESS [  1.860 s]
[INFO] midPoint Model - impl .............................. SUCCESS [ 24.985 s]
[INFO] midPoint Notifications - impl ...................... SUCCESS [  8.946 s]
[INFO] midPoint Report - impl ............................. SUCCESS [  9.333 s]
[INFO] midPoint Model - integration tests ................. SUCCESS [  7.650 s]
[INFO] midPoint Workflow - api ............................ SUCCESS [  2.360 s]
[INFO] midPoint Cases - impl .............................. SUCCESS [  3.642 s]
[INFO] midPoint Workflow - impl ........................... SUCCESS [ 10.838 s]
[INFO] midPoint Access Certification - impl ............... SUCCESS [  9.399 s]
[INFO] midPoint Authentication - impl ..................... SUCCESS [ 13.541 s]
[INFO] midPoint REST-ish service implementation ........... SUCCESS [  4.511 s]
[INFO] midPoint Customizations ............................ SUCCESS [  0.660 s]
[INFO] midPoint User Interface ............................ SUCCESS [  0.149 s]
[INFO] midPoint User Interface - admin web gui ............ FAILURE [ 37.677 s]
[INFO] midPoint Spring Boot JAR ........................... SKIPPED
[INFO] midPoint Testing Infrastructure .................... SKIPPED
[INFO] midPoint Testing - Resource Connection Tests ....... SKIPPED
[INFO] midPoint Testing - Long Tests ...................... SKIPPED
[INFO] midPoint Testing - Story Tests ..................... SKIPPED
[INFO] midPoint Testing - REST API ........................ SKIPPED
[INFO] ------------------------------------------------------------------------
[INFO] BUILD FAILURE
[INFO] ------------------------------------------------------------------------
[INFO] Total time:  08:41 min
[INFO] Finished at: 2025-02-19T16:41:36Z
[INFO] ------------------------------------------------------------------------
[ERROR] Failed to execute goal com.github.eirslett:frontend-maven-plugin:1.15.1:npm (npm install) on project admin-gui: Failed to run task: 'npm install' failed. org.apache.commons.exec.ExecuteException: Process exited with an error: 1 (Exit value: 1) -> [Help 1]
[ERROR] 
[ERROR] To see the full stack trace of the errors, re-run Maven with the -e switch.
[ERROR] Re-run Maven using the -X switch to enable full debug logging.
[ERROR] 
[ERROR] For more information about the errors and possible solutions, please read the following articles:
[ERROR] [Help 1] http://cwiki.apache.org/confluence/display/MAVEN/MojoFailureException
[ERROR] 
[ERROR] After correcting the problems, you can resume the build with the command
[ERROR]   mvn <args> -rf :admin-gui
[Pipeline] }
[Pipeline] // withCredentials
[Pipeline] }
[Pipeline] // container
[Pipeline] }
[Pipeline] // stage
[Pipeline] error
[Pipeline] step


More information about the midPoint-ci mailing list