[midPoint-ci] Build failed in Jenkins: midPoint - support 4.9 - Native repo, PG 16, JDK 21 (Eclipse Temurin) #61

Jenkins noreply at evolveum.com
Tue Feb 11 07:04:00 CET 2025


See <https://jenkins.evolveum.com/job/midpoint-support-4-9-native-pg16-jdk21/61/display/redirect>

Changes:


------------------------------------------
[...truncated 5813 lines...]
[INFO] 
[INFO] --- compiler:3.11.0:testCompile (default-testCompile) @ admin-gui ---
[INFO] Changes detected - recompiling the module! :dependency
[INFO] Compiling 23 source files with javac [debug target 17] to target/test-classes
[WARNING] system modules path not set in conjunction with -source 17
[WARNING] /home/jenkins/agent/workspace/midpoint-support-4-9-native-pg16-jdk21/gui/admin-gui/src/test/java/com/evolveum/midpoint/gui/TestIntegrationObjectWrapperFactory.java:[191,101] non-varargs call of varargs method with inexact argument type for last parameter;
  cast to java.lang.Object for a varargs call
  cast to java.lang.Object[] for a non-varargs call and to suppress this warning
[WARNING] /home/jenkins/agent/workspace/midpoint-support-4-9-native-pg16-jdk21/gui/admin-gui/src/test/java/com/evolveum/midpoint/gui/TestIntegrationObjectWrapperFactory.java:[201,119] non-varargs call of varargs method with inexact argument type for last parameter;
  cast to java.lang.Object for a varargs call
  cast to java.lang.Object[] for a non-varargs call and to suppress this warning
[WARNING] /home/jenkins/agent/workspace/midpoint-support-4-9-native-pg16-jdk21/gui/admin-gui/src/test/java/com/evolveum/midpoint/gui/TestIntegrationObjectWrapperFactory.java:[273,101] non-varargs call of varargs method with inexact argument type for last parameter;
  cast to java.lang.Object for a varargs call
  cast to java.lang.Object[] for a non-varargs call and to suppress this warning
[WARNING] /home/jenkins/agent/workspace/midpoint-support-4-9-native-pg16-jdk21/gui/admin-gui/src/test/java/com/evolveum/midpoint/gui/TestIntegrationObjectWrapperFactory.java:[329,97] non-varargs call of varargs method with inexact argument type for last parameter;
  cast to java.lang.Object for a varargs call
  cast to java.lang.Object[] for a non-varargs call and to suppress this warning
[WARNING] /home/jenkins/agent/workspace/midpoint-support-4-9-native-pg16-jdk21/gui/admin-gui/src/test/java/com/evolveum/midpoint/gui/TestIntegrationObjectWrapperFactory.java:[330,101] non-varargs call of varargs method with inexact argument type for last parameter;
  cast to java.lang.Object for a varargs call
  cast to java.lang.Object[] for a non-varargs call and to suppress this warning
[WARNING] /home/jenkins/agent/workspace/midpoint-support-4-9-native-pg16-jdk21/gui/admin-gui/src/test/java/com/evolveum/midpoint/gui/TestIntegrationObjectWrapperFactory.java:[336,126] non-varargs call of varargs method with inexact argument type for last parameter;
  cast to java.lang.Object for a varargs call
  cast to java.lang.Object[] for a non-varargs call and to suppress this warning
[WARNING] /home/jenkins/agent/workspace/midpoint-support-4-9-native-pg16-jdk21/gui/admin-gui/src/test/java/com/evolveum/midpoint/gui/TestIntegrationObjectWrapperFactory.java:[337,119] non-varargs call of varargs method with inexact argument type for last parameter;
  cast to java.lang.Object for a varargs call
  cast to java.lang.Object[] for a non-varargs call and to suppress this warning
[WARNING] /home/jenkins/agent/workspace/midpoint-support-4-9-native-pg16-jdk21/gui/admin-gui/src/test/java/com/evolveum/midpoint/gui/TestIntegrationObjectWrapperFactory.java:[404,101] non-varargs call of varargs method with inexact argument type for last parameter;
  cast to java.lang.Object for a varargs call
  cast to java.lang.Object[] for a non-varargs call and to suppress this warning
[WARNING] /home/jenkins/agent/workspace/midpoint-support-4-9-native-pg16-jdk21/gui/admin-gui/src/test/java/com/evolveum/midpoint/gui/TestIntegrationObjectWrapperFactory.java:[487,119] non-varargs call of varargs method with inexact argument type for last parameter;
  cast to java.lang.Object for a varargs call
  cast to java.lang.Object[] for a non-varargs call and to suppress this warning
[WARNING] /home/jenkins/agent/workspace/midpoint-support-4-9-native-pg16-jdk21/gui/admin-gui/src/test/java/com/evolveum/midpoint/gui/TestIntegrationObjectWrapperFactory.java:[546,100] non-varargs call of varargs method with inexact argument type for last parameter;
  cast to java.lang.Object for a varargs call
  cast to java.lang.Object[] for a non-varargs call and to suppress this warning
[WARNING] /home/jenkins/agent/workspace/midpoint-support-4-9-native-pg16-jdk21/gui/admin-gui/src/test/java/com/evolveum/midpoint/gui/TestIntegrationObjectWrapperFactory.java:[553,119] non-varargs call of varargs method with inexact argument type for last parameter;
  cast to java.lang.Object for a varargs call
  cast to java.lang.Object[] for a non-varargs call and to suppress this warning
[WARNING] /home/jenkins/agent/workspace/midpoint-support-4-9-native-pg16-jdk21/gui/admin-gui/src/test/java/com/evolveum/midpoint/gui/TestIntegrationObjectWrapperFactory.java:[639,119] non-varargs call of varargs method with inexact argument type for last parameter;
  cast to java.lang.Object for a varargs call
  cast to java.lang.Object[] for a non-varargs call and to suppress this warning
[INFO] /home/jenkins/agent/workspace/midpoint-support-4-9-native-pg16-jdk21/gui/admin-gui/src/test/java/com/evolveum/midpoint/web/AbstractGuiIntegrationTest.java: Some input files use or override a deprecated API.
[INFO] /home/jenkins/agent/workspace/midpoint-support-4-9-native-pg16-jdk21/gui/admin-gui/src/test/java/com/evolveum/midpoint/web/AbstractGuiIntegrationTest.java: Recompile with -Xlint:deprecation for details.
[INFO] /home/jenkins/agent/workspace/midpoint-support-4-9-native-pg16-jdk21/gui/admin-gui/src/test/java/com/evolveum/midpoint/gui/MidScaleGuiTest.java: Some input files use unchecked or unsafe operations.
[INFO] /home/jenkins/agent/workspace/midpoint-support-4-9-native-pg16-jdk21/gui/admin-gui/src/test/java/com/evolveum/midpoint/gui/MidScaleGuiTest.java: Recompile with -Xlint:unchecked for details.
[INFO] 
[INFO] --- surefire:3.1.2:test (default-test) @ admin-gui ---
[INFO] Using configured provider org.apache.maven.surefire.testng.TestNGProvider
[INFO] 
[INFO] -------------------------------------------------------
[INFO]  T E S T S
[INFO] -------------------------------------------------------
[INFO] Running Unit
[INFO] Tests run: 0, Failures: 0, Errors: 0, Skipped: 0, Time elapsed: 11.57 s -- in Unit
[INFO] 
[INFO] Results:
[INFO] 
[INFO] Tests run: 0, Failures: 0, Errors: 0, Skipped: 0
[INFO] 
[INFO] 
[INFO] --- jar:3.4.2:jar (default-jar) @ admin-gui ---
[INFO] Building jar: /home/jenkins/agent/workspace/midpoint-support-4-9-native-pg16-jdk21/gui/admin-gui/target/admin-gui-4.9.2-SNAPSHOT.jar
[INFO] 
[INFO] >>> source:3.1.0:jar (attach-sources) > generate-sources @ admin-gui >>>
[INFO] 
[INFO] --- enforcer:3.4.1:enforce (enforce) @ admin-gui ---
[INFO] Rule 1: org.apache.maven.enforcer.rules.dependency.DependencyConvergence passed
[INFO] Rule 2: org.apache.maven.enforcer.rules.dependency.BannedDependencies passed
[INFO] 
[INFO] --- checkstyle:3.1.2:check (validate) @ admin-gui ---
[INFO] Starting audit...
Audit done.
[INFO] You have 0 Checkstyle violations.
[INFO] 
[INFO] --- gitdescribe:3.0:gitdescribe (git-describe) @ admin-gui ---
[INFO] 
[INFO] --- git-commit-id:4.9.10:revision (default) @ admin-gui ---
[INFO] 
[INFO] <<< source:3.1.0:jar (attach-sources) < generate-sources @ admin-gui <<<
[INFO] 
[INFO] 
[INFO] --- source:3.1.0:jar (attach-sources) @ admin-gui ---
[INFO] Building jar: /home/jenkins/agent/workspace/midpoint-support-4-9-native-pg16-jdk21/gui/admin-gui/target/admin-gui-4.9.2-SNAPSHOT-sources.jar
[INFO] 
[INFO] --- jar:3.4.2:test-jar (default) @ admin-gui ---
[INFO] Building jar: /home/jenkins/agent/workspace/midpoint-support-4-9-native-pg16-jdk21/gui/admin-gui/target/admin-gui-4.9.2-SNAPSHOT-tests.jar
[INFO] 
[INFO] --- failsafe:3.1.2:integration-test (integration-test) @ admin-gui ---
[INFO] Using configured provider org.apache.maven.surefire.testng.TestNGProvider
[INFO] 
[INFO] -------------------------------------------------------
[INFO]  T E S T S
[INFO] -------------------------------------------------------
[INFO] Running Integration
OpenJDK 64-Bit Server VM warning: Sharing is only supported for boot loader classes because bootstrap classpath has been appended
[INFO] Tests run: 64, Failures: 0, Errors: 0, Skipped: 0, Time elapsed: 437.4 s -- in Integration
[INFO] 
[INFO] Results:
[INFO] 
[INFO] Tests run: 64, Failures: 0, Errors: 0, Skipped: 0
[INFO] 
[INFO] 
[INFO] --- failsafe:3.1.2:verify (integration-test) @ admin-gui ---
[INFO] 
[INFO] --- dependency:3.3.0:analyze-only (analyze) @ admin-gui ---
[INFO] No dependency problems found
[INFO] 
[INFO] --- install:3.1.3:install (default-install) @ admin-gui ---
[INFO] Installing /home/jenkins/agent/workspace/midpoint-support-4-9-native-pg16-jdk21/gui/admin-gui/pom.xml to /root/.m2/repository/com/evolveum/midpoint/gui/admin-gui/4.9.2-SNAPSHOT/admin-gui-4.9.2-SNAPSHOT.pom
[INFO] Installing /home/jenkins/agent/workspace/midpoint-support-4-9-native-pg16-jdk21/gui/admin-gui/target/admin-gui-4.9.2-SNAPSHOT.jar to /root/.m2/repository/com/evolveum/midpoint/gui/admin-gui/4.9.2-SNAPSHOT/admin-gui-4.9.2-SNAPSHOT.jar
[INFO] Installing /home/jenkins/agent/workspace/midpoint-support-4-9-native-pg16-jdk21/gui/admin-gui/target/admin-gui-4.9.2-SNAPSHOT-sources.jar to /root/.m2/repository/com/evolveum/midpoint/gui/admin-gui/4.9.2-SNAPSHOT/admin-gui-4.9.2-SNAPSHOT-sources.jar
[INFO] Installing /home/jenkins/agent/workspace/midpoint-support-4-9-native-pg16-jdk21/gui/admin-gui/target/admin-gui-4.9.2-SNAPSHOT-tests.jar to /root/.m2/repository/com/evolveum/midpoint/gui/admin-gui/4.9.2-SNAPSHOT/admin-gui-4.9.2-SNAPSHOT-tests.jar
[INFO] 
[INFO] ---------------< com.evolveum.midpoint.testing:testing >----------------
[INFO] Building midPoint Testing Infrastructure 4.9.2-SNAPSHOT          [60/64]
[INFO]   from testing/pom.xml
[INFO] --------------------------------[ pom ]---------------------------------
[INFO] 
[INFO] --- clean:3.3.2:clean (default-clean) @ testing ---
[INFO] 
[INFO] --- enforcer:3.4.1:enforce (enforce) @ testing ---
[INFO] Rule 1: org.apache.maven.enforcer.rules.dependency.DependencyConvergence passed
[INFO] Rule 2: org.apache.maven.enforcer.rules.dependency.BannedDependencies passed
[INFO] 
[INFO] --- checkstyle:3.1.2:check (validate) @ testing ---
[INFO] Starting audit...
Audit done.
[INFO] You have 0 Checkstyle violations.
[INFO] 
[INFO] --- gitdescribe:3.0:gitdescribe (git-describe) @ testing ---
[INFO] Setting Git Describe: v4.9.2devel-11-g9a1e6e0e30e
[INFO] 
[INFO] >>> source:3.1.0:jar (attach-sources) > generate-sources @ testing >>>
[INFO] 
[INFO] --- enforcer:3.4.1:enforce (enforce) @ testing ---
[INFO] Rule 1: org.apache.maven.enforcer.rules.dependency.DependencyConvergence passed
[INFO] Rule 2: org.apache.maven.enforcer.rules.dependency.BannedDependencies passed
[INFO] 
[INFO] --- checkstyle:3.1.2:check (validate) @ testing ---
[INFO] Starting audit...
Audit done.
[INFO] You have 0 Checkstyle violations.
[INFO] 
[INFO] --- gitdescribe:3.0:gitdescribe (git-describe) @ testing ---
[INFO] 
[INFO] <<< source:3.1.0:jar (attach-sources) < generate-sources @ testing <<<
[INFO] 
[INFO] 
[INFO] --- source:3.1.0:jar (attach-sources) @ testing ---
[INFO] 
[INFO] --- dependency:3.3.0:analyze-only (analyze) @ testing ---
[INFO] Skipping pom project
[INFO] 
[INFO] --- install:3.1.3:install (default-install) @ testing ---
[INFO] Skipping artifact installation
[INFO] 
[INFO] ---------------< com.evolveum.midpoint.testing:conntest >---------------
[INFO] Building midPoint Testing - Resource Connection Tests 4.9.2-SNAPSHOT [61/64]
[INFO]   from testing/conntest/pom.xml
[INFO] --------------------------------[ jar ]---------------------------------
[INFO] ------------------------------------------------------------------------
[INFO] Reactor Summary for midPoint Project 4.9.2-SNAPSHOT:
[INFO] 
[INFO] midPoint Project ................................... SUCCESS [ 14.691 s]
[INFO] midPoint Infrastructure ............................ SUCCESS [  0.161 s]
[INFO] midPoint Infrastructure - schema ................... SUCCESS [02:52 min]
[INFO] midPoint Repository ................................ SUCCESS [  0.087 s]
[INFO] midPoint Repository - api .......................... SUCCESS [  0.524 s]
[INFO] midPoint Task Manager - api ........................ SUCCESS [  1.223 s]
[INFO] midPoint Infrastructure - testing utils (lvl 2) .... SUCCESS [ 13.102 s]
[INFO] midPoint Infrastructure - common ................... SUCCESS [ 34.947 s]
[INFO] midPoint Audit - api ............................... SUCCESS [  0.503 s]
[INFO] midPoint Security - api ............................ SUCCESS [  0.824 s]
[INFO] midPoint Repository - SQL common support ........... SUCCESS [  1.115 s]
[INFO] midPoint Repository - sql repository ............... SUCCESS [  5.207 s]
[INFO] midPoint System Initialization ..................... SUCCESS [ 33.331 s]
[INFO] midPoint Repository - new SQL repository ........... SUCCESS [02:54 min]
[INFO] midPoint Repository - sql repository test .......... SUCCESS [  3.389 s]
[INFO] midPoint Repository Cache .......................... SUCCESS [ 47.919 s]
[INFO] midPoint Audit - logging impl ...................... SUCCESS [  0.286 s]
[INFO] midPoint Icf Connectors ............................ SUCCESS [  0.075 s]
[INFO] Dummy Resource ..................................... SUCCESS [  1.858 s]
[INFO] midPoint Repository - test utils ................... SUCCESS [  3.608 s]
[INFO] midPoint Security - impl ........................... SUCCESS [  1.693 s]
[INFO] midPoint Task Manager - Quartz impl ................ SUCCESS [01:55 min]
[INFO] midPoint Tools ..................................... SUCCESS [  0.084 s]
[INFO] midPoint Tools - Ninja ............................. SUCCESS [ 52.479 s]
[INFO] midPoint Tools - custom Spring Boot JAR layout ..... SUCCESS [  0.265 s]
[INFO] midPoint Infrastructure - pure JAXB schema ......... SUCCESS [ 13.114 s]
[INFO] midPoint Repo Commons .............................. SUCCESS [08:16 min]
[INFO] midPoint Security Enforcer - api ................... SUCCESS [  0.379 s]
[INFO] midPoint Security Enforcer - impl .................. SUCCESS [  0.839 s]
[INFO] midPoint Provisioning .............................. SUCCESS [  0.073 s]
[INFO] midPoint Provisioning - api ........................ SUCCESS [  0.429 s]
[INFO] Unified Connector Framework - api .................. SUCCESS [  0.538 s]
[INFO] Dummy Connector .................................... SUCCESS [  0.582 s]
[INFO] Unified Connector Framework - ConnId impl .......... SUCCESS [01:42 min]
[INFO] Unified Connector Framework - Built-in impl ........ SUCCESS [  1.750 s]
[INFO] midPoint Provisioning - impl ....................... SUCCESS [12:37 min]
[INFO] midPoint Model ..................................... SUCCESS [  0.082 s]
[INFO] midPoint Model - api ............................... SUCCESS [  1.421 s]
[INFO] midPoint Model - common ............................ SUCCESS [ 43.262 s]
[INFO] midPoint Notifications - api ....................... SUCCESS [  0.436 s]
[INFO] Dummy Connector Fake ............................... SUCCESS [  0.152 s]
[INFO] midPoint Authentication - api ...................... SUCCESS [  0.694 s]
[INFO] midPoint Model - test .............................. SUCCESS [  2.142 s]
[INFO] midPoint Report - api .............................. SUCCESS [  0.272 s]
[INFO] midPoint Cases - api ............................... SUCCESS [  0.347 s]
[INFO] midPoint Access Certification - api ................ SUCCESS [  0.244 s]
[INFO] midPoint Model - impl .............................. SUCCESS [04:58 min]
[INFO] midPoint Notifications - impl ...................... SUCCESS [ 25.059 s]
[INFO] midPoint Report - impl ............................. SUCCESS [03:41 min]
[INFO] midPoint Model - integration tests ................. SUCCESS [  01:01 h]
[INFO] midPoint Workflow - api ............................ SUCCESS [  0.413 s]
[INFO] midPoint Cases - impl .............................. SUCCESS [  0.768 s]
[INFO] midPoint Workflow - impl ........................... SUCCESS [05:55 min]
[INFO] midPoint Access Certification - impl ............... SUCCESS [01:53 min]
[INFO] midPoint Authentication - impl ..................... SUCCESS [01:15 min]
[INFO] midPoint REST-ish service implementation ........... SUCCESS [  0.753 s]
[INFO] midPoint Customizations ............................ SUCCESS [  0.677 s]
[INFO] midPoint User Interface ............................ SUCCESS [  0.089 s]
[INFO] midPoint User Interface - admin web gui ............ SUCCESS [09:55 min]
[INFO] midPoint Testing Infrastructure .................... SUCCESS [  0.077 s]
[INFO] midPoint Testing - Resource Connection Tests ....... FAILURE [ 12.472 s]
[INFO] midPoint Testing - Long Tests ...................... SKIPPED
[INFO] midPoint Testing - Story Tests ..................... SKIPPED
[INFO] midPoint Testing - REST API ........................ SKIPPED
[INFO] ------------------------------------------------------------------------
[INFO] BUILD FAILURE
[INFO] ------------------------------------------------------------------------
[INFO] Total time:  02:04 h
[INFO] Finished at: 2025-02-11T06:03:59Z
[INFO] ------------------------------------------------------------------------
[ERROR] Failed to execute goal on project conntest: Could not resolve dependencies for project com.evolveum.midpoint.testing:conntest:jar:4.9.2-SNAPSHOT: Failed to collect dependencies at com.evolveum.polygon:connector-ssh:jar:1.0: Failed to read artifact descriptor for com.evolveum.polygon:connector-ssh:jar:1.0: The following artifacts could not be resolved: com.evolveum.polygon:connector-ssh:pom:1.0 (absent): Could not transfer artifact com.evolveum.polygon:connector-ssh:pom:1.0 from/to evolveum (https://nexus.evolveum.com/nexus/repository/public/): Connect to nexus.evolveum.com:443 [nexus.evolveum.com/185.50.215.182] failed: Connect timed out -> [Help 1]
[ERROR] 
[ERROR] To see the full stack trace of the errors, re-run Maven with the -e switch.
[ERROR] Re-run Maven using the -X switch to enable full debug logging.
[ERROR] 
[ERROR] For more information about the errors and possible solutions, please read the following articles:
[ERROR] [Help 1] http://cwiki.apache.org/confluence/display/MAVEN/DependencyResolutionException
[ERROR] 
[ERROR] After correcting the problems, you can resume the build with the command
[ERROR]   mvn <args> -rf :conntest
[Pipeline] }
[Pipeline] // container
[Pipeline] }
[Pipeline] // stage
[Pipeline] error
[Pipeline] step


More information about the midPoint-ci mailing list