[midPoint-ci] Build failed in Jenkins: midPoint - master - compile #4721
Jenkins
noreply at evolveum.com
Tue Feb 11 00:33:22 CET 2025
See <https://jenkins.evolveum.com/job/midpoint-master-compile/4721/display/redirect>
Changes:
------------------------------------------
[...truncated 1254 lines...]
[INFO]
[INFO] >>> source:3.1.0:jar (attach-sources) > generate-sources @ repo >>>
[INFO]
[INFO] --- enforcer:3.5.0:enforce (enforce) @ repo ---
[INFO] Rule 1: org.apache.maven.enforcer.rules.dependency.DependencyConvergence passed
[INFO] Rule 2: org.apache.maven.enforcer.rules.dependency.BannedDependencies passed
[INFO]
[INFO] --- checkstyle:3.1.2:check (validate) @ repo ---
[INFO] Starting audit...
Audit done.
[INFO] You have 0 Checkstyle violations.
[INFO]
[INFO] --- gitdescribe:3.0:gitdescribe (git-describe) @ repo ---
[INFO]
[INFO] <<< source:3.1.0:jar (attach-sources) < generate-sources @ repo <<<
[INFO]
[INFO]
[INFO] --- source:3.1.0:jar (attach-sources) @ repo ---
[INFO]
[INFO] ----------------< com.evolveum.midpoint.repo:repo-api >-----------------
[INFO] Building midPoint Repository - api 4.10-SNAPSHOT [5/64]
[INFO] from repo/repo-api/pom.xml
[INFO] --------------------------------[ jar ]---------------------------------
[INFO]
[INFO] --- clean:3.4.0:clean (default-clean) @ repo-api ---
[INFO]
[INFO] --- enforcer:3.5.0:enforce (enforce) @ repo-api ---
[INFO] Rule 1: org.apache.maven.enforcer.rules.dependency.DependencyConvergence passed
[INFO] Rule 2: org.apache.maven.enforcer.rules.dependency.BannedDependencies passed
[INFO]
[INFO] --- checkstyle:3.1.2:check (validate) @ repo-api ---
[INFO] Starting audit...
Audit done.
[INFO] You have 0 Checkstyle violations.
[INFO]
[INFO] --- gitdescribe:3.0:gitdescribe (git-describe) @ repo-api ---
[INFO] Setting Git Describe: v4.10devel-875-g6eea86c51b5
[INFO]
[INFO] --- resources:3.1.0:resources (default-resources) @ repo-api ---
[INFO] Using 'UTF-8' encoding to copy filtered resources.
[INFO] skip non existing resourceDirectory /home/jenkins/agent/workspace/midpoint-master-compile/repo/repo-api/src/main/resources
[INFO]
[INFO] --- compiler:3.11.0:compile (default-compile) @ repo-api ---
[INFO] Changes detected - recompiling the module! :dependency
[INFO] Compiling 39 source files with javac [debug target 17] to target/classes
[WARNING] system modules path not set in conjunction with -source 17
[INFO] /home/jenkins/agent/workspace/midpoint-master-compile/repo/repo-api/src/main/java/com/evolveum/midpoint/repo/api/CacheDispatcher.java: /home/jenkins/agent/workspace/midpoint-master-compile/repo/repo-api/src/main/java/com/evolveum/midpoint/repo/api/CacheDispatcher.java uses or overrides a deprecated API.
[INFO] /home/jenkins/agent/workspace/midpoint-master-compile/repo/repo-api/src/main/java/com/evolveum/midpoint/repo/api/CacheDispatcher.java: Recompile with -Xlint:deprecation for details.
[INFO] /home/jenkins/agent/workspace/midpoint-master-compile/repo/repo-api/src/main/java/com/evolveum/midpoint/repo/api/RepositoryService.java: Some input files use unchecked or unsafe operations.
[INFO] /home/jenkins/agent/workspace/midpoint-master-compile/repo/repo-api/src/main/java/com/evolveum/midpoint/repo/api/RepositoryService.java: Recompile with -Xlint:unchecked for details.
[INFO]
[INFO] --- resources:3.1.0:testResources (default-testResources) @ repo-api ---
[INFO] Not copying test resources
[INFO]
[INFO] --- compiler:3.11.0:testCompile (default-testCompile) @ repo-api ---
[INFO] Not compiling test sources
[INFO]
[INFO] --- surefire:3.1.2:test (default-test) @ repo-api ---
[INFO] Tests are skipped.
[INFO]
[INFO] --- jar:3.4.2:jar (default-jar) @ repo-api ---
[INFO] Building jar: /home/jenkins/agent/workspace/midpoint-master-compile/repo/repo-api/target/repo-api-4.10-SNAPSHOT.jar
[INFO]
[INFO] >>> source:3.1.0:jar (attach-sources) > generate-sources @ repo-api >>>
[INFO]
[INFO] --- enforcer:3.5.0:enforce (enforce) @ repo-api ---
[INFO] Rule 1: org.apache.maven.enforcer.rules.dependency.DependencyConvergence passed
[INFO] Rule 2: org.apache.maven.enforcer.rules.dependency.BannedDependencies passed
[INFO]
[INFO] --- checkstyle:3.1.2:check (validate) @ repo-api ---
[INFO] Starting audit...
Audit done.
[INFO] You have 0 Checkstyle violations.
[INFO]
[INFO] --- gitdescribe:3.0:gitdescribe (git-describe) @ repo-api ---
[INFO]
[INFO] <<< source:3.1.0:jar (attach-sources) < generate-sources @ repo-api <<<
[INFO]
[INFO]
[INFO] --- source:3.1.0:jar (attach-sources) @ repo-api ---
[INFO] Building jar: /home/jenkins/agent/workspace/midpoint-master-compile/repo/repo-api/target/repo-api-4.10-SNAPSHOT-sources.jar
[INFO]
[INFO] ----------------< com.evolveum.midpoint.repo:task-api >-----------------
[INFO] Building midPoint Task Manager - api 4.10-SNAPSHOT [6/64]
[INFO] from repo/task-api/pom.xml
[INFO] --------------------------------[ jar ]---------------------------------
[INFO]
[INFO] --- clean:3.4.0:clean (default-clean) @ task-api ---
[INFO]
[INFO] --- enforcer:3.5.0:enforce (enforce) @ task-api ---
[INFO] Rule 1: org.apache.maven.enforcer.rules.dependency.DependencyConvergence passed
[INFO] Rule 2: org.apache.maven.enforcer.rules.dependency.BannedDependencies passed
[INFO]
[INFO] --- checkstyle:3.1.2:check (validate) @ task-api ---
[INFO] Starting audit...
Audit done.
[INFO] You have 0 Checkstyle violations.
[INFO]
[INFO] --- gitdescribe:3.0:gitdescribe (git-describe) @ task-api ---
[INFO] Setting Git Describe: v4.10devel-875-g6eea86c51b5
[INFO]
[INFO] --- resources:3.1.0:resources (default-resources) @ task-api ---
[INFO] Using 'UTF-8' encoding to copy filtered resources.
[INFO] skip non existing resourceDirectory /home/jenkins/agent/workspace/midpoint-master-compile/repo/task-api/src/main/resources
[INFO]
[INFO] --- compiler:3.11.0:compile (default-compile) @ task-api ---
[INFO] Changes detected - recompiling the module! :dependency
[INFO] Compiling 43 source files with javac [debug target 17] to target/classes
[WARNING] system modules path not set in conjunction with -source 17
[INFO] /home/jenkins/agent/workspace/midpoint-master-compile/repo/task-api/src/main/java/com/evolveum/midpoint/task/api/Task.java: /home/jenkins/agent/workspace/midpoint-master-compile/repo/task-api/src/main/java/com/evolveum/midpoint/task/api/Task.java uses unchecked or unsafe operations.
[INFO] /home/jenkins/agent/workspace/midpoint-master-compile/repo/task-api/src/main/java/com/evolveum/midpoint/task/api/Task.java: Recompile with -Xlint:unchecked for details.
[INFO]
[INFO] --- resources:3.1.0:testResources (default-testResources) @ task-api ---
[INFO] Not copying test resources
[INFO]
[INFO] --- compiler:3.11.0:testCompile (default-testCompile) @ task-api ---
[INFO] Not compiling test sources
[INFO]
[INFO] --- surefire:3.1.2:test (default-test) @ task-api ---
[INFO] Tests are skipped.
[INFO]
[INFO] --- jar:3.4.2:jar (default-jar) @ task-api ---
[INFO] Building jar: /home/jenkins/agent/workspace/midpoint-master-compile/repo/task-api/target/task-api-4.10-SNAPSHOT.jar
[INFO]
[INFO] >>> source:3.1.0:jar (attach-sources) > generate-sources @ task-api >>>
[INFO]
[INFO] --- enforcer:3.5.0:enforce (enforce) @ task-api ---
[INFO] Rule 1: org.apache.maven.enforcer.rules.dependency.DependencyConvergence passed
[INFO] Rule 2: org.apache.maven.enforcer.rules.dependency.BannedDependencies passed
[INFO]
[INFO] --- checkstyle:3.1.2:check (validate) @ task-api ---
[INFO] Starting audit...
Audit done.
[INFO] You have 0 Checkstyle violations.
[INFO]
[INFO] --- gitdescribe:3.0:gitdescribe (git-describe) @ task-api ---
[INFO]
[INFO] <<< source:3.1.0:jar (attach-sources) < generate-sources @ task-api <<<
[INFO]
[INFO]
[INFO] --- source:3.1.0:jar (attach-sources) @ task-api ---
[INFO] Building jar: /home/jenkins/agent/workspace/midpoint-master-compile/repo/task-api/target/task-api-4.10-SNAPSHOT-sources.jar
[INFO]
[INFO] ---------------< com.evolveum.midpoint.infra:test-util >----------------
[INFO] Building midPoint Infrastructure - testing utils (lvl 2) 4.10-SNAPSHOT [7/64]
[INFO] from infra/test-util/pom.xml
[INFO] --------------------------------[ jar ]---------------------------------
ERROR: Failed to launch midpoint-master-compile-4721-151hr-tl1xz-vnw5v
io.fabric8.kubernetes.client.KubernetesClientTimeoutException: Timed out waiting for [1000000] milliseconds for [Pod] with name:[midpoint-master-compile-4721-151hr-tl1xz-vnw5v] in namespace [jenkins].
at PluginClassLoader for kubernetes-client-api//io.fabric8.kubernetes.client.dsl.internal.BaseOperation.waitUntilCondition(BaseOperation.java:939)
at PluginClassLoader for kubernetes-client-api//io.fabric8.kubernetes.client.dsl.internal.BaseOperation.waitUntilReady(BaseOperation.java:921)
at PluginClassLoader for kubernetes-client-api//io.fabric8.kubernetes.client.dsl.internal.BaseOperation.waitUntilReady(BaseOperation.java:97)
at PluginClassLoader for kubernetes//org.csanchez.jenkins.plugins.kubernetes.KubernetesLauncher.launch(KubernetesLauncher.java:222)
at hudson.slaves.SlaveComputer.lambda$_connect$0(SlaveComputer.java:297)
at jenkins.util.ContextResettingExecutorService$2.call(ContextResettingExecutorService.java:46)
at jenkins.security.ImpersonatingExecutorService$2.call(ImpersonatingExecutorService.java:80)
at java.base/java.util.concurrent.FutureTask.run(Unknown Source)
at java.base/java.util.concurrent.ThreadPoolExecutor.runWorker(Unknown Source)
at java.base/java.util.concurrent.ThreadPoolExecutor$Worker.run(Unknown Source)
at java.base/java.lang.Thread.run(Unknown Source)
[INFO] ------------------------------------------------------------------------
[INFO] Reactor Summary for midPoint Project 4.10-SNAPSHOT:
[INFO]
[INFO] midPoint Project ................................... SUCCESS [01:59 min]
[INFO] midPoint Infrastructure ............................ SUCCESS [ 0.153 s]
[INFO] midPoint Infrastructure - schema ................... SUCCESS [02:55 min]
[INFO] midPoint Repository ................................ SUCCESS [ 0.096 s]
[INFO] midPoint Repository - api .......................... SUCCESS [ 0.522 s]
[INFO] midPoint Task Manager - api ........................ SUCCESS [ 28.176 s]
[INFO] midPoint Infrastructure - testing utils (lvl 2) .... FAILURE [ 30.167 s]
[INFO] midPoint Infrastructure - common ................... SKIPPED
[INFO] midPoint Audit - api ............................... SKIPPED
[INFO] midPoint Security - api ............................ SKIPPED
[INFO] midPoint Repository - SQL common support ........... SKIPPED
[INFO] midPoint Repository - sql repository ............... SKIPPED
[INFO] midPoint System Initialization ..................... SKIPPED
[INFO] midPoint Repository - new SQL repository ........... SKIPPED
[INFO] midPoint Repository - sql repository test .......... SKIPPED
[INFO] midPoint Repository Cache .......................... SKIPPED
[INFO] midPoint Audit - logging impl ...................... SKIPPED
[INFO] midPoint Icf Connectors ............................ SKIPPED
[INFO] Dummy Resource ..................................... SKIPPED
[INFO] midPoint Repository - test utils ................... SKIPPED
[INFO] midPoint Security - impl ........................... SKIPPED
[INFO] midPoint Task Manager - Quartz impl ................ SKIPPED
[INFO] midPoint Tools ..................................... SKIPPED
[INFO] midPoint Tools - Ninja ............................. SKIPPED
[INFO] midPoint Tools - custom Spring Boot JAR layout ..... SKIPPED
[INFO] midPoint Infrastructure - pure JAXB schema ......... SKIPPED
[INFO] midPoint Repo Commons .............................. SKIPPED
[INFO] midPoint Security Enforcer - api ................... SKIPPED
[INFO] midPoint Security Enforcer - impl .................. SKIPPED
[INFO] midPoint Provisioning .............................. SKIPPED
[INFO] midPoint Provisioning - api ........................ SKIPPED
[INFO] Unified Connector Framework - api .................. SKIPPED
[INFO] Dummy Connector .................................... SKIPPED
[INFO] Unified Connector Framework - ConnId impl .......... SKIPPED
[INFO] Unified Connector Framework - Built-in impl ........ SKIPPED
[INFO] midPoint Provisioning - impl ....................... SKIPPED
[INFO] midPoint Model ..................................... SKIPPED
[INFO] midPoint Model - api ............................... SKIPPED
[INFO] midPoint Model - common ............................ SKIPPED
[INFO] midPoint Notifications - api ....................... SKIPPED
[INFO] Dummy Connector Fake ............................... SKIPPED
[INFO] midPoint Authentication - api ...................... SKIPPED
[INFO] midPoint Model - test .............................. SKIPPED
[INFO] midPoint Report - api .............................. SKIPPED
[INFO] midPoint Cases - api ............................... SKIPPED
[INFO] midPoint Access Certification - api ................ SKIPPED
[INFO] midPoint Model - impl .............................. SKIPPED
[INFO] midPoint Notifications - impl ...................... SKIPPED
[INFO] midPoint Report - impl ............................. SKIPPED
[INFO] midPoint Model - integration tests ................. SKIPPED
[INFO] midPoint Workflow - api ............................ SKIPPED
[INFO] midPoint Cases - impl .............................. SKIPPED
[INFO] midPoint Workflow - impl ........................... SKIPPED
[INFO] midPoint Access Certification - impl ............... SKIPPED
[INFO] midPoint Authentication - impl ..................... SKIPPED
[INFO] midPoint REST-ish service implementation ........... SKIPPED
[INFO] midPoint Customizations ............................ SKIPPED
[INFO] midPoint User Interface ............................ SKIPPED
[INFO] midPoint User Interface - admin web gui ............ SKIPPED
[INFO] midPoint Testing Infrastructure .................... SKIPPED
[INFO] midPoint Testing - Resource Connection Tests ....... SKIPPED
[INFO] midPoint Testing - Long Tests ...................... SKIPPED
[INFO] midPoint Testing - Story Tests ..................... SKIPPED
[INFO] midPoint Testing - REST API ........................ SKIPPED
[INFO] ------------------------------------------------------------------------
[INFO] BUILD FAILURE
[INFO] ------------------------------------------------------------------------
[INFO] Total time: 05:58 min
[INFO] Finished at: 2025-02-10T23:33:21Z
[INFO] ------------------------------------------------------------------------
[ERROR] Failed to execute goal on project test-util: Could not resolve dependencies for project com.evolveum.midpoint.infra:test-util:jar:4.10-SNAPSHOT: Failed to collect dependencies at org.forgerock.opendj:opendj:jar:2.6.2: Failed to read artifact descriptor for org.forgerock.opendj:opendj:jar:2.6.2: The following artifacts could not be resolved: org.forgerock.opendj:opendj:pom:2.6.2 (absent): Could not transfer artifact org.forgerock.opendj:opendj:pom:2.6.2 from/to evolveum (https://nexus.evolveum.com/nexus/repository/public/): Connect to nexus.evolveum.com:443 [nexus.evolveum.com/185.50.215.182] failed: Connect timed out -> [Help 1]
[ERROR]
[ERROR] To see the full stack trace of the errors, re-run Maven with the -e switch.
[ERROR] Re-run Maven using the -X switch to enable full debug logging.
[ERROR]
[ERROR] For more information about the errors and possible solutions, please read the following articles:
[ERROR] [Help 1] http://cwiki.apache.org/confluence/display/MAVEN/DependencyResolutionException
[ERROR]
[ERROR] After correcting the problems, you can resume the build with the command
[ERROR] mvn <args> -rf :test-util
[Pipeline] }
[Pipeline] // container
[Pipeline] }
[Pipeline] // stage
[Pipeline] error
[Pipeline] step
More information about the midPoint-ci
mailing list