[midPoint-ci] Build failed in Jenkins: midPoint - support 4.8 - Generic repo, Oracle 23ai free JDK 21 (Eclipse Temurin) #9
Jenkins
noreply at evolveum.com
Tue Feb 4 19:02:39 CET 2025
See <https://jenkins.evolveum.com/job/midpoint-support-4-8-generic-oracle23-jdk21/9/display/redirect>
Changes:
------------------------------------------
[...truncated 21756 lines...]
at org.apache.maven.surefire.testng.TestNGExecutor.run(TestNGExecutor.java:308)
at org.apache.maven.surefire.testng.TestNGXmlTestSuite.execute(TestNGXmlTestSuite.java:71)
at org.apache.maven.surefire.testng.TestNGProvider.invoke(TestNGProvider.java:113)
at org.apache.maven.surefire.booter.ForkedBooter.runSuitesInProcess(ForkedBooter.java:385)
at org.apache.maven.surefire.booter.ForkedBooter.execute(ForkedBooter.java:162)
at org.apache.maven.surefire.booter.ForkedBooter.run(ForkedBooter.java:507)
at org.apache.maven.surefire.booter.ForkedBooter.main(ForkedBooter.java:495)
[INFO]
[INFO] Results:
[INFO]
[ERROR] Failures:
[ERROR] TestConfiguredCapabilitiesActivation>AbstractTestNGSpringContextTests.springTestContextPrepareTestInstance:119 » IllegalState ApplicationContext failure threshold (1) exceeded: skipping repeated attempt to load context for [MergedContextConfiguration at 3192d0f7 testClass = com.evolveum.midpoint.testing.story.TestConfiguredCapabilitiesActivation, locations = ["classpath:ctx-story-test-main.xml"], classes = [], contextInitializerClasses = [], activeProfiles = [], propertySourceDescriptors = [], propertySourceProperties = [], contextCustomizers = [], contextLoader = org.springframework.test.context.support.DelegatingSmartContextLoader, parent = null]
[ERROR] TestDelayedEnable>AbstractTestNGSpringContextTests.springTestContextPrepareTestInstance:119 » IllegalState ApplicationContext failure threshold (1) exceeded: skipping repeated attempt to load context for [MergedContextConfiguration at 16c5b5a4 testClass = com.evolveum.midpoint.testing.story.TestDelayedEnable, locations = ["classpath:ctx-story-test-main.xml"], classes = [], contextInitializerClasses = [], activeProfiles = [], propertySourceDescriptors = [], propertySourceProperties = [], contextCustomizers = [], contextLoader = org.springframework.test.context.support.DelegatingSmartContextLoader, parent = null]
[ERROR] TestDelivery>AbstractTestNGSpringContextTests.springTestContextPrepareTestInstance:119 » IllegalState ApplicationContext failure threshold (1) exceeded: skipping repeated attempt to load context for [MergedContextConfiguration at 4135c3d1 testClass = com.evolveum.midpoint.testing.story.TestDelivery, locations = ["classpath:ctx-story-test-main.xml"], classes = [], contextInitializerClasses = [], activeProfiles = [], propertySourceDescriptors = [], propertySourceProperties = [], contextCustomizers = [], contextLoader = org.springframework.test.context.support.DelegatingSmartContextLoader, parent = null]
[ERROR] TestDependencyRename>AbstractTestNGSpringContextTests.springTestContextPrepareTestInstance:119 » IllegalState ApplicationContext failure threshold (1) exceeded: skipping repeated attempt to load context for [MergedContextConfiguration at 29e94b6d testClass = com.evolveum.midpoint.testing.story.TestDependencyRename, locations = ["classpath:ctx-story-test-main.xml"], classes = [], contextInitializerClasses = [], activeProfiles = [], propertySourceDescriptors = [], propertySourceProperties = [], contextCustomizers = [], contextLoader = org.springframework.test.context.support.DelegatingSmartContextLoader, parent = null]
[ERROR] TestExistentialIssues>AbstractTestNGSpringContextTests.springTestContextPrepareTestInstance:119 » IllegalState ApplicationContext failure threshold (1) exceeded: skipping repeated attempt to load context for [MergedContextConfiguration at 66f1fc7e testClass = com.evolveum.midpoint.testing.story.TestExistentialIssues, locations = ["classpath:ctx-story-test-main.xml"], classes = [], contextInitializerClasses = [], activeProfiles = [], propertySourceDescriptors = [], propertySourceProperties = [], contextCustomizers = [], contextLoader = org.springframework.test.context.support.DelegatingSmartContextLoader, parent = null]
[ERROR] TestFirstSteps>AbstractTestNGSpringContextTests.springTestContextPrepareTestInstance:119 » IllegalState ApplicationContext failure threshold (1) exceeded: skipping repeated attempt to load context for [MergedContextConfiguration at 79201e17 testClass = com.evolveum.midpoint.testing.story.TestFirstSteps, locations = ["classpath:ctx-story-test-main.xml"], classes = [], contextInitializerClasses = [], activeProfiles = [], propertySourceDescriptors = [], propertySourceProperties = [], contextCustomizers = [], contextLoader = org.springframework.test.context.support.DelegatingSmartContextLoader, parent = null]
[ERROR] TestImportGroups>AbstractTestNGSpringContextTests.springTestContextPrepareTestInstance:119 » IllegalState ApplicationContext failure threshold (1) exceeded: skipping repeated attempt to load context for [MergedContextConfiguration at 40bd0410 testClass = com.evolveum.midpoint.testing.story.TestImportGroups, locations = ["classpath:ctx-story-test-main.xml"], classes = [], contextInitializerClasses = [], activeProfiles = [], propertySourceDescriptors = [], propertySourceProperties = [], contextCustomizers = [], contextLoader = org.springframework.test.context.support.DelegatingSmartContextLoader, parent = null]
[ERROR] TestInboundOutboundAssociation>AbstractTestNGSpringContextTests.springTestContextPrepareTestInstance:119 » IllegalState ApplicationContext failure threshold (1) exceeded: skipping repeated attempt to load context for [MergedContextConfiguration at 1a0e76be testClass = com.evolveum.midpoint.testing.story.TestInboundOutboundAssociation, locations = ["classpath:ctx-story-test-main.xml"], classes = [], contextInitializerClasses = [], activeProfiles = [], propertySourceDescriptors = [], propertySourceProperties = [], contextCustomizers = [], contextLoader = org.springframework.test.context.support.DelegatingSmartContextLoader, parent = null]
[ERROR] TestInducement>AbstractTestNGSpringContextTests.springTestContextPrepareTestInstance:119 » IllegalState ApplicationContext failure threshold (1) exceeded: skipping repeated attempt to load context for [MergedContextConfiguration at 7010abea testClass = com.evolveum.midpoint.testing.story.TestInducement, locations = ["classpath:ctx-story-test-main.xml"], classes = [], contextInitializerClasses = [], activeProfiles = [], propertySourceDescriptors = [], propertySourceProperties = [], contextCustomizers = [], contextLoader = org.springframework.test.context.support.DelegatingSmartContextLoader, parent = null]
[ERROR] TestLimitedResources>AbstractTestNGSpringContextTests.springTestContextPrepareTestInstance:119 » IllegalState ApplicationContext failure threshold (1) exceeded: skipping repeated attempt to load context for [MergedContextConfiguration at 1125cc24 testClass = com.evolveum.midpoint.testing.story.TestLimitedResources, locations = ["classpath:ctx-story-test-main.xml"], classes = [], contextInitializerClasses = [], activeProfiles = [], propertySourceDescriptors = [], propertySourceProperties = [], contextCustomizers = [], contextLoader = org.springframework.test.context.support.DelegatingSmartContextLoader, parent = null]
[ERROR] TestMachineIntelligence>AbstractTestNGSpringContextTests.springTestContextPrepareTestInstance:119 » IllegalState ApplicationContext failure threshold (1) exceeded: skipping repeated attempt to load context for [MergedContextConfiguration at 271fcbf3 testClass = com.evolveum.midpoint.testing.story.TestMachineIntelligence, locations = ["classpath:ctx-story-test-main.xml"], classes = [], contextInitializerClasses = [], activeProfiles = [], propertySourceDescriptors = [], propertySourceProperties = [], contextCustomizers = [], contextLoader = org.springframework.test.context.support.DelegatingSmartContextLoader, parent = null]
[ERROR] TestMapleLeaf>AbstractTestNGSpringContextTests.springTestContextPrepareTestInstance:119 » IllegalState ApplicationContext failure threshold (1) exceeded: skipping repeated attempt to load context for [MergedContextConfiguration at 3ee326a0 testClass = com.evolveum.midpoint.testing.story.TestMapleLeaf, locations = ["classpath:ctx-story-test-main.xml"], classes = [], contextInitializerClasses = [], activeProfiles = [], propertySourceDescriptors = [], propertySourceProperties = [], contextCustomizers = [], contextLoader = org.springframework.test.context.support.DelegatingSmartContextLoader, parent = null]
[ERROR] TestMappingMadness>AbstractTestNGSpringContextTests.springTestContextPrepareTestInstance:119 » IllegalState ApplicationContext failure threshold (1) exceeded: skipping repeated attempt to load context for [MergedContextConfiguration at 44e44b99 testClass = com.evolveum.midpoint.testing.story.TestMappingMadness, locations = ["classpath:ctx-story-test-main.xml"], classes = [], contextInitializerClasses = [], activeProfiles = [], propertySourceDescriptors = [], propertySourceProperties = [], contextCustomizers = [], contextLoader = org.springframework.test.context.support.DelegatingSmartContextLoader, parent = null]
[ERROR] TestMisbehavingResources>AbstractTestNGSpringContextTests.springTestContextPrepareTestInstance:119 » IllegalState ApplicationContext failure threshold (1) exceeded: skipping repeated attempt to load context for [MergedContextConfiguration at 58595f67 testClass = com.evolveum.midpoint.testing.story.TestMisbehavingResources, locations = ["classpath:ctx-story-test-main.xml"], classes = [], contextInitializerClasses = [], activeProfiles = [], propertySourceDescriptors = [], propertySourceProperties = [], contextCustomizers = [], contextLoader = org.springframework.test.context.support.DelegatingSmartContextLoader, parent = null]
[ERROR] TestNormalizers>AbstractTestNGSpringContextTests.springTestContextPrepareTestInstance:119 » IllegalState ApplicationContext failure threshold (1) exceeded: skipping repeated attempt to load context for [MergedContextConfiguration at 1081aae9 testClass = com.evolveum.midpoint.testing.story.TestNormalizers, locations = ["classpath:ctx-story-test-main.xml"], classes = [], contextInitializerClasses = [], activeProfiles = [], propertySourceDescriptors = [], propertySourceProperties = [], contextCustomizers = [], contextLoader = org.springframework.test.context.support.DelegatingSmartContextLoader, parent = null]
[ERROR] TestNullAttribute>AbstractTestNGSpringContextTests.springTestContextPrepareTestInstance:119 » IllegalState ApplicationContext failure threshold (1) exceeded: skipping repeated attempt to load context for [MergedContextConfiguration at 5f128f7 testClass = com.evolveum.midpoint.testing.story.TestNullAttribute, locations = ["classpath:ctx-story-test-main.xml"], classes = [], contextInitializerClasses = [], activeProfiles = [], propertySourceDescriptors = [], propertySourceProperties = [], contextCustomizers = [], contextLoader = org.springframework.test.context.support.DelegatingSmartContextLoader, parent = null]
[ERROR] TestOperationPerf>AbstractTestNGSpringContextTests.springTestContextPrepareTestInstance:119 » IllegalState ApplicationContext failure threshold (1) exceeded: skipping repeated attempt to load context for [MergedContextConfiguration at 60265535 testClass = com.evolveum.midpoint.testing.story.TestOperationPerf, locations = ["classpath:ctx-story-test-main.xml"], classes = [], contextInitializerClasses = [], activeProfiles = [], propertySourceDescriptors = [], propertySourceProperties = [], contextCustomizers = [], contextLoader = org.springframework.test.context.support.DelegatingSmartContextLoader, parent = null]
[ERROR] TestOrgSync>AbstractTestNGSpringContextTests.springTestContextPrepareTestInstance:119 » IllegalState Failed to load ApplicationContext for [MergedContextConfiguration at 19a155bf testClass = com.evolveum.midpoint.testing.story.TestOrgSync, locations = ["classpath:ctx-story-test-main.xml"], classes = [], contextInitializerClasses = [], activeProfiles = [], propertySourceDescriptors = [], propertySourceProperties = [], contextCustomizers = [], contextLoader = org.springframework.test.context.support.DelegatingSmartContextLoader, parent = null]
[ERROR] TestOrphanedTasks>AbstractTestNGSpringContextTests.springTestContextPrepareTestInstance:119 » IllegalState ApplicationContext failure threshold (1) exceeded: skipping repeated attempt to load context for [MergedContextConfiguration at 4cb2ec58 testClass = com.evolveum.midpoint.testing.story.TestOrphanedTasks, locations = ["classpath:ctx-story-test-main.xml"], classes = [], contextInitializerClasses = [], activeProfiles = [], propertySourceDescriptors = [], propertySourceProperties = [], contextCustomizers = [], contextLoader = org.springframework.test.context.support.DelegatingSmartContextLoader, parent = null]
[ERROR] TestPhotoAssignment>AbstractTestNGSpringContextTests.springTestContextPrepareTestInstance:119 » IllegalState ApplicationContext failure threshold (1) exceeded: skipping repeated attempt to load context for [MergedContextConfiguration at 28d4c825 testClass = com.evolveum.midpoint.testing.story.TestPhotoAssignment, locations = ["classpath:ctx-story-test-main.xml"], classes = [], contextInitializerClasses = [], activeProfiles = [], propertySourceDescriptors = [], propertySourceProperties = [], contextCustomizers = [], contextLoader = org.springframework.test.context.support.DelegatingSmartContextLoader, parent = null]
[ERROR] TestPlentyOfAssignments>AbstractTestNGSpringContextTests.springTestContextPrepareTestInstance:119 » IllegalState ApplicationContext failure threshold (1) exceeded: skipping repeated attempt to load context for [MergedContextConfiguration at 35e3881a testClass = com.evolveum.midpoint.testing.story.TestPlentyOfAssignments, locations = ["classpath:ctx-story-test-main.xml"], classes = [], contextInitializerClasses = [], activeProfiles = [], propertySourceDescriptors = [], propertySourceProperties = [], contextCustomizers = [], contextLoader = org.springframework.test.context.support.DelegatingSmartContextLoader, parent = null]
[ERROR] TestReconNullValue>AbstractTestNGSpringContextTests.springTestContextPrepareTestInstance:119 » IllegalState ApplicationContext failure threshold (1) exceeded: skipping repeated attempt to load context for [MergedContextConfiguration at 3dfc2432 testClass = com.evolveum.midpoint.testing.story.TestReconNullValue, locations = ["classpath:ctx-story-test-main.xml"], classes = [], contextInitializerClasses = [], activeProfiles = [], propertySourceDescriptors = [], propertySourceProperties = [], contextCustomizers = [], contextLoader = org.springframework.test.context.support.DelegatingSmartContextLoader, parent = null]
[ERROR] TestResourceInMaintenance>AbstractTestNGSpringContextTests.springTestContextPrepareTestInstance:119 » IllegalState ApplicationContext failure threshold (1) exceeded: skipping repeated attempt to load context for [MergedContextConfiguration at 7bf163d4 testClass = com.evolveum.midpoint.testing.story.TestResourceInMaintenance, locations = ["classpath:ctx-story-test-main.xml"], classes = [], contextInitializerClasses = [], activeProfiles = [], propertySourceDescriptors = [], propertySourceProperties = [], contextCustomizers = [], contextLoader = org.springframework.test.context.support.DelegatingSmartContextLoader, parent = null]
[ERROR] TestRetirement>AbstractTestNGSpringContextTests.springTestContextPrepareTestInstance:119 » IllegalState ApplicationContext failure threshold (1) exceeded: skipping repeated attempt to load context for [MergedContextConfiguration at 72c32363 testClass = com.evolveum.midpoint.testing.story.TestRetirement, locations = ["classpath:ctx-story-test-main.xml"], classes = [], contextInitializerClasses = [], activeProfiles = [], propertySourceDescriptors = [], propertySourceProperties = [], contextCustomizers = [], contextLoader = org.springframework.test.context.support.DelegatingSmartContextLoader, parent = null]
[ERROR] TestScience>AbstractTestNGSpringContextTests.springTestContextPrepareTestInstance:119 » IllegalState ApplicationContext failure threshold (1) exceeded: skipping repeated attempt to load context for [MergedContextConfiguration at 4423dd32 testClass = com.evolveum.midpoint.testing.story.TestScience, locations = ["classpath:ctx-story-test-main.xml"], classes = [], contextInitializerClasses = [], activeProfiles = [], propertySourceDescriptors = [], propertySourceProperties = [], contextCustomizers = [], contextLoader = org.springframework.test.context.support.DelegatingSmartContextLoader, parent = null]
[ERROR] TestServiceAccounts>AbstractTestNGSpringContextTests.springTestContextPrepareTestInstance:119 » IllegalState ApplicationContext failure threshold (1) exceeded: skipping repeated attempt to load context for [MergedContextConfiguration at 11cb7808 testClass = com.evolveum.midpoint.testing.story.TestServiceAccounts, locations = ["classpath:ctx-story-test-main.xml"], classes = [], contextInitializerClasses = [], activeProfiles = [], propertySourceDescriptors = [], propertySourceProperties = [], contextCustomizers = [], contextLoader = org.springframework.test.context.support.DelegatingSmartContextLoader, parent = null]
[ERROR] TestStrings>AbstractTestNGSpringContextTests.springTestContextPrepareTestInstance:119 » IllegalState ApplicationContext failure threshold (1) exceeded: skipping repeated attempt to load context for [MergedContextConfiguration at 2432d255 testClass = com.evolveum.midpoint.testing.story.TestStrings, locations = ["classpath:ctx-story-test-main.xml"], classes = [], contextInitializerClasses = [], activeProfiles = [], propertySourceDescriptors = [], propertySourceProperties = [], contextCustomizers = [], contextLoader = org.springframework.test.context.support.DelegatingSmartContextLoader, parent = null]
[ERROR] TestThresholdsStoryLiveSyncExecute>AbstractTestNGSpringContextTests.springTestContextPrepareTestInstance:119 » IllegalState ApplicationContext failure threshold (1) exceeded: skipping repeated attempt to load context for [MergedContextConfiguration at 136418d2 testClass = com.evolveum.midpoint.testing.story.TestThresholdsStoryLiveSyncExecute, locations = ["classpath:ctx-story-test-main.xml"], classes = [], contextInitializerClasses = [], activeProfiles = [], propertySourceDescriptors = [], propertySourceProperties = [], contextCustomizers = [], contextLoader = org.springframework.test.context.support.DelegatingSmartContextLoader, parent = null]
[ERROR] TestThresholdsStoryLiveSyncExecuteMultithreaded>AbstractTestNGSpringContextTests.springTestContextPrepareTestInstance:119 » IllegalState ApplicationContext failure threshold (1) exceeded: skipping repeated attempt to load context for [MergedContextConfiguration at b7439ff testClass = com.evolveum.midpoint.testing.story.TestThresholdsStoryLiveSyncExecuteMultithreaded, locations = ["classpath:ctx-story-test-main.xml"], classes = [], contextInitializerClasses = [], activeProfiles = [], propertySourceDescriptors = [], propertySourceProperties = [], contextCustomizers = [], contextLoader = org.springframework.test.context.support.DelegatingSmartContextLoader, parent = null]
[ERROR] TestThresholdsStoryLiveSyncSimulate>AbstractTestNGSpringContextTests.springTestContextPrepareTestInstance:119 » IllegalState ApplicationContext failure threshold (1) exceeded: skipping repeated attempt to load context for [MergedContextConfiguration at 401a24a2 testClass = com.evolveum.midpoint.testing.story.TestThresholdsStoryLiveSyncSimulate, locations = ["classpath:ctx-story-test-main.xml"], classes = [], contextInitializerClasses = [], activeProfiles = [], propertySourceDescriptors = [], propertySourceProperties = [], contextCustomizers = [], contextLoader = org.springframework.test.context.support.DelegatingSmartContextLoader, parent = null]
[ERROR] TestThresholdsStoryLiveSyncSimulateMultithreaded>AbstractTestNGSpringContextTests.springTestContextPrepareTestInstance:119 » IllegalState ApplicationContext failure threshold (1) exceeded: skipping repeated attempt to load context for [MergedContextConfiguration at 133dd2e8 testClass = com.evolveum.midpoint.testing.story.TestThresholdsStoryLiveSyncSimulateMultithreaded, locations = ["classpath:ctx-story-test-main.xml"], classes = [], contextInitializerClasses = [], activeProfiles = [], propertySourceDescriptors = [], propertySourceProperties = [], contextCustomizers = [], contextLoader = org.springframework.test.context.support.DelegatingSmartContextLoader, parent = null]
[ERROR] TestThresholdsStoryReconExecute>AbstractTestNGSpringContextTests.springTestContextPrepareTestInstance:119 » IllegalState ApplicationContext failure threshold (1) exceeded: skipping repeated attempt to load context for [MergedContextConfiguration at 2427fb78 testClass = com.evolveum.midpoint.testing.story.TestThresholdsStoryReconExecute, locations = ["classpath:ctx-story-test-main.xml"], classes = [], contextInitializerClasses = [], activeProfiles = [], propertySourceDescriptors = [], propertySourceProperties = [], contextCustomizers = [], contextLoader = org.springframework.test.context.support.DelegatingSmartContextLoader, parent = null]
[ERROR] TestThresholdsStoryReconExecuteMultinode>AbstractTestNGSpringContextTests.springTestContextPrepareTestInstance:119 » IllegalState ApplicationContext failure threshold (1) exceeded: skipping repeated attempt to load context for [MergedContextConfiguration at 789256a testClass = com.evolveum.midpoint.testing.story.TestThresholdsStoryReconExecuteMultinode, locations = ["classpath:ctx-story-test-main.xml"], classes = [], contextInitializerClasses = [], activeProfiles = [], propertySourceDescriptors = [], propertySourceProperties = [], contextCustomizers = [], contextLoader = org.springframework.test.context.support.DelegatingSmartContextLoader, parent = null]
[ERROR] TestThresholdsStoryReconExecuteMultithreaded>AbstractTestNGSpringContextTests.springTestContextPrepareTestInstance:119 » IllegalState ApplicationContext failure threshold (1) exceeded: skipping repeated attempt to load context for [MergedContextConfiguration at 72649940 testClass = com.evolveum.midpoint.testing.story.TestThresholdsStoryReconExecuteMultithreaded, locations = ["classpath:ctx-story-test-main.xml"], classes = [], contextInitializerClasses = [], activeProfiles = [], propertySourceDescriptors = [], propertySourceProperties = [], contextCustomizers = [], contextLoader = org.springframework.test.context.support.DelegatingSmartContextLoader, parent = null]
[ERROR] TestThresholdsStoryReconSimulate>AbstractTestNGSpringContextTests.springTestContextPrepareTestInstance:119 » IllegalState ApplicationContext failure threshold (1) exceeded: skipping repeated attempt to load context for [MergedContextConfiguration at 3f65896e testClass = com.evolveum.midpoint.testing.story.TestThresholdsStoryReconSimulate, locations = ["classpath:ctx-story-test-main.xml"], classes = [], contextInitializerClasses = [], activeProfiles = [], propertySourceDescriptors = [], propertySourceProperties = [], contextCustomizers = [], contextLoader = org.springframework.test.context.support.DelegatingSmartContextLoader, parent = null]
[ERROR] TestThresholdsStoryReconSimulateMultithreaded>AbstractTestNGSpringContextTests.springTestContextPrepareTestInstance:119 » IllegalState ApplicationContext failure threshold (1) exceeded: skipping repeated attempt to load context for [MergedContextConfiguration at 2d66443f testClass = com.evolveum.midpoint.testing.story.TestThresholdsStoryReconSimulateMultithreaded, locations = ["classpath:ctx-story-test-main.xml"], classes = [], contextInitializerClasses = [], activeProfiles = [], propertySourceDescriptors = [], propertySourceProperties = [], contextCustomizers = [], contextLoader = org.springframework.test.context.support.DelegatingSmartContextLoader, parent = null]
[ERROR] TestTrustedBulkActions>AbstractTestNGSpringContextTests.springTestContextPrepareTestInstance:119 » IllegalState ApplicationContext failure threshold (1) exceeded: skipping repeated attempt to load context for [MergedContextConfiguration at 73b7cc3d testClass = com.evolveum.midpoint.testing.story.TestTrustedBulkActions, locations = ["classpath:ctx-story-test-main.xml"], classes = [], contextInitializerClasses = [], activeProfiles = [], propertySourceDescriptors = [], propertySourceProperties = [], contextCustomizers = [], contextLoader = org.springframework.test.context.support.DelegatingSmartContextLoader, parent = null]
[ERROR] TestUniversity>AbstractTestNGSpringContextTests.springTestContextPrepareTestInstance:119 » IllegalState ApplicationContext failure threshold (1) exceeded: skipping repeated attempt to load context for [MergedContextConfiguration at 16c2ce65 testClass = com.evolveum.midpoint.testing.story.TestUniversity, locations = ["classpath:ctx-story-test-main.xml"], classes = [], contextInitializerClasses = [], activeProfiles = [], propertySourceDescriptors = [], propertySourceProperties = [], contextCustomizers = [], contextLoader = org.springframework.test.context.support.DelegatingSmartContextLoader, parent = null]
[ERROR] TestUnix>AbstractTestNGSpringContextTests.springTestContextPrepareTestInstance:119 » IllegalState ApplicationContext failure threshold (1) exceeded: skipping repeated attempt to load context for [MergedContextConfiguration at 2722583e testClass = com.evolveum.midpoint.testing.story.TestUnix, locations = ["classpath:ctx-story-test-main.xml"], classes = [], contextInitializerClasses = [], activeProfiles = [], propertySourceDescriptors = [], propertySourceProperties = [], contextCustomizers = [], contextLoader = org.springframework.test.context.support.DelegatingSmartContextLoader, parent = null]
[ERROR] TestUnixTolerantAux>AbstractTestNGSpringContextTests.springTestContextPrepareTestInstance:119 » IllegalState ApplicationContext failure threshold (1) exceeded: skipping repeated attempt to load context for [MergedContextConfiguration at 3547931 testClass = com.evolveum.midpoint.testing.story.TestUnixTolerantAux, locations = ["classpath:ctx-story-test-main.xml"], classes = [], contextInitializerClasses = [], activeProfiles = [], propertySourceDescriptors = [], propertySourceProperties = [], contextCustomizers = [], contextLoader = org.springframework.test.context.support.DelegatingSmartContextLoader, parent = null]
[ERROR] TestVeryAuthoritativeSource>AbstractTestNGSpringContextTests.springTestContextPrepareTestInstance:119 » IllegalState ApplicationContext failure threshold (1) exceeded: skipping repeated attempt to load context for [MergedContextConfiguration at 640bb98e testClass = com.evolveum.midpoint.testing.story.TestVeryAuthoritativeSource, locations = ["classpath:ctx-story-test-main.xml"], classes = [], contextInitializerClasses = [], activeProfiles = [], propertySourceDescriptors = [], propertySourceProperties = [], contextCustomizers = [], contextLoader = org.springframework.test.context.support.DelegatingSmartContextLoader, parent = null]
[ERROR] TestWriter>AbstractTestNGSpringContextTests.springTestContextPrepareTestInstance:119 » IllegalState ApplicationContext failure threshold (1) exceeded: skipping repeated attempt to load context for [MergedContextConfiguration at bf57310 testClass = com.evolveum.midpoint.testing.story.TestWriter, locations = ["classpath:ctx-story-test-main.xml"], classes = [], contextInitializerClasses = [], activeProfiles = [], propertySourceDescriptors = [], propertySourceProperties = [], contextCustomizers = [], contextLoader = org.springframework.test.context.support.DelegatingSmartContextLoader, parent = null]
[ERROR] TestAsyncProvisioning>AbstractTestNGSpringContextTests.springTestContextPrepareTestInstance:119 » IllegalState ApplicationContext failure threshold (1) exceeded: skipping repeated attempt to load context for [MergedContextConfiguration at 2ea37ad5 testClass = com.evolveum.midpoint.testing.story.async.TestAsyncProvisioning, locations = ["classpath:ctx-story-test-main.xml"], classes = [], contextInitializerClasses = [], activeProfiles = [], propertySourceDescriptors = [], propertySourceProperties = [], contextCustomizers = [], contextLoader = org.springframework.test.context.support.DelegatingSmartContextLoader, parent = null]
[ERROR] TestConsistencyMechanism>AbstractTestNGSpringContextTests.springTestContextPrepareTestInstance:119 » IllegalState ApplicationContext failure threshold (1) exceeded: skipping repeated attempt to load context for [MergedContextConfiguration at 4419c9e6 testClass = com.evolveum.midpoint.testing.story.consistency.TestConsistencyMechanism, locations = ["classpath:ctx-story-test-main.xml"], classes = [], contextInitializerClasses = [], activeProfiles = [], propertySourceDescriptors = [], propertySourceProperties = [], contextCustomizers = [], contextLoader = org.springframework.test.context.support.DelegatingSmartContextLoader, parent = null]
[ERROR] TestConsistencyReaper>AbstractTestNGSpringContextTests.springTestContextPrepareTestInstance:119 » IllegalState ApplicationContext failure threshold (1) exceeded: skipping repeated attempt to load context for [MergedContextConfiguration at 59b32095 testClass = com.evolveum.midpoint.testing.story.consistency.TestConsistencyReaper, locations = ["classpath:ctx-story-test-main.xml"], classes = [], contextInitializerClasses = [], activeProfiles = [], propertySourceDescriptors = [], propertySourceProperties = [], contextCustomizers = [], contextLoader = org.springframework.test.context.support.DelegatingSmartContextLoader, parent = null]
[ERROR] TestIdMatchCorrelationMediumDummy>AbstractTestNGSpringContextTests.springTestContextPrepareTestInstance:119 » IllegalState ApplicationContext failure threshold (1) exceeded: skipping repeated attempt to load context for [MergedContextConfiguration at 2b501762 testClass = com.evolveum.midpoint.testing.story.correlation.TestIdMatchCorrelationMediumDummy, locations = ["classpath:ctx-story-test-main.xml"], classes = [], contextInitializerClasses = [], activeProfiles = [], propertySourceDescriptors = [], propertySourceProperties = [], contextCustomizers = [], contextLoader = org.springframework.test.context.support.DelegatingSmartContextLoader, parent = null]
[ERROR] TestIdMatchCorrelationMultiAccountsDummy>AbstractTestNGSpringContextTests.springTestContextPrepareTestInstance:119 » IllegalState ApplicationContext failure threshold (1) exceeded: skipping repeated attempt to load context for [MergedContextConfiguration at 509d44a9 testClass = com.evolveum.midpoint.testing.story.correlation.TestIdMatchCorrelationMultiAccountsDummy, locations = ["classpath:ctx-story-test-main.xml"], classes = [], contextInitializerClasses = [], activeProfiles = [], propertySourceDescriptors = [], propertySourceProperties = [], contextCustomizers = [], contextLoader = org.springframework.test.context.support.DelegatingSmartContextLoader, parent = null]
[ERROR] TestIdMatchCorrelationSimpleDummy>AbstractTestNGSpringContextTests.springTestContextPrepareTestInstance:119 » IllegalState ApplicationContext failure threshold (1) exceeded: skipping repeated attempt to load context for [MergedContextConfiguration at 6c8b76f4 testClass = com.evolveum.midpoint.testing.story.correlation.TestIdMatchCorrelationSimpleDummy, locations = ["classpath:ctx-story-test-main.xml"], classes = [], contextInitializerClasses = [], activeProfiles = [], propertySourceDescriptors = [], propertySourceProperties = [], contextCustomizers = [], contextLoader = org.springframework.test.context.support.DelegatingSmartContextLoader, parent = null]
[ERROR] TestInternalCorrelationMedium>AbstractTestNGSpringContextTests.springTestContextPrepareTestInstance:119 » IllegalState ApplicationContext failure threshold (1) exceeded: skipping repeated attempt to load context for [MergedContextConfiguration at 24b9e46e testClass = com.evolveum.midpoint.testing.story.correlation.TestInternalCorrelationMedium, locations = ["classpath:ctx-story-test-main.xml"], classes = [], contextInitializerClasses = [], activeProfiles = [], propertySourceDescriptors = [], propertySourceProperties = [], contextCustomizers = [], contextLoader = org.springframework.test.context.support.DelegatingSmartContextLoader, parent = null]
[ERROR] TestInternalCorrelationMultiAccounts>AbstractTestNGSpringContextTests.springTestContextPrepareTestInstance:119 » IllegalState ApplicationContext failure threshold (1) exceeded: skipping repeated attempt to load context for [MergedContextConfiguration at 44eefd91 testClass = com.evolveum.midpoint.testing.story.correlation.TestInternalCorrelationMultiAccounts, locations = ["classpath:ctx-story-test-main.xml"], classes = [], contextInitializerClasses = [], activeProfiles = [], propertySourceDescriptors = [], propertySourceProperties = [], contextCustomizers = [], contextLoader = org.springframework.test.context.support.DelegatingSmartContextLoader, parent = null]
[ERROR] TestInternalCorrelationSimple>AbstractTestNGSpringContextTests.springTestContextPrepareTestInstance:119 » IllegalState ApplicationContext failure threshold (1) exceeded: skipping repeated attempt to load context for [MergedContextConfiguration at 437c2e44 testClass = com.evolveum.midpoint.testing.story.correlation.TestInternalCorrelationSimple, locations = ["classpath:ctx-story-test-main.xml"], classes = [], contextInitializerClasses = [], activeProfiles = [], propertySourceDescriptors = [], propertySourceProperties = [], contextCustomizers = [], contextLoader = org.springframework.test.context.support.DelegatingSmartContextLoader, parent = null]
[ERROR] TestInternalCorrelationSimpleSimplified>AbstractTestNGSpringContextTests.springTestContextPrepareTestInstance:119 » IllegalState ApplicationContext failure threshold (1) exceeded: skipping repeated attempt to load context for [MergedContextConfiguration at 602b3065 testClass = com.evolveum.midpoint.testing.story.correlation.TestInternalCorrelationSimpleSimplified, locations = ["classpath:ctx-story-test-main.xml"], classes = [], contextInitializerClasses = [], activeProfiles = [], propertySourceDescriptors = [], propertySourceProperties = [], contextCustomizers = [], contextLoader = org.springframework.test.context.support.DelegatingSmartContextLoader, parent = null]
[ERROR] TestGrouperAsyncUpdate>AbstractTestNGSpringContextTests.springTestContextPrepareTestInstance:119 » IllegalState ApplicationContext failure threshold (1) exceeded: skipping repeated attempt to load context for [MergedContextConfiguration at 4cfd527 testClass = com.evolveum.midpoint.testing.story.grouper.TestGrouperAsyncUpdate, locations = ["classpath:ctx-story-test-main.xml"], classes = [], contextInitializerClasses = [], activeProfiles = [], propertySourceDescriptors = [], propertySourceProperties = [], contextCustomizers = [], contextLoader = org.springframework.test.context.support.DelegatingSmartContextLoader, parent = null]
[ERROR] TestLdapComplex>AbstractTestNGSpringContextTests.springTestContextPrepareTestInstance:119 » IllegalState ApplicationContext failure threshold (1) exceeded: skipping repeated attempt to load context for [MergedContextConfiguration at 6110fde1 testClass = com.evolveum.midpoint.testing.story.ldap.TestLdapComplex, locations = ["classpath:ctx-story-test-main.xml"], classes = [], contextInitializerClasses = [], activeProfiles = [], propertySourceDescriptors = [], propertySourceProperties = [], contextCustomizers = [], contextLoader = org.springframework.test.context.support.DelegatingSmartContextLoader, parent = null]
[ERROR] TestLdapDependency>AbstractTestNGSpringContextTests.springTestContextPrepareTestInstance:119 » IllegalState ApplicationContext failure threshold (1) exceeded: skipping repeated attempt to load context for [MergedContextConfiguration at a1b491f testClass = com.evolveum.midpoint.testing.story.ldap.TestLdapDependency, locations = ["classpath:ctx-story-test-main.xml"], classes = [], contextInitializerClasses = [], activeProfiles = [], propertySourceDescriptors = [], propertySourceProperties = [], contextCustomizers = [], contextLoader = org.springframework.test.context.support.DelegatingSmartContextLoader, parent = null]
[ERROR] TestLdapMutilated>AbstractTestNGSpringContextTests.springTestContextPrepareTestInstance:119 » IllegalState ApplicationContext failure threshold (1) exceeded: skipping repeated attempt to load context for [MergedContextConfiguration at 81a66d3 testClass = com.evolveum.midpoint.testing.story.ldap.TestLdapMutilated, locations = ["classpath:ctx-story-test-main.xml"], classes = [], contextInitializerClasses = [], activeProfiles = [], propertySourceDescriptors = [], propertySourceProperties = [], contextCustomizers = [], contextLoader = org.springframework.test.context.support.DelegatingSmartContextLoader, parent = null]
[ERROR] TestLdapSyncMassive>AbstractTestNGSpringContextTests.springTestContextPrepareTestInstance:119 » IllegalState ApplicationContext failure threshold (1) exceeded: skipping repeated attempt to load context for [MergedContextConfiguration at 79bac413 testClass = com.evolveum.midpoint.testing.story.ldap.TestLdapSyncMassive, locations = ["classpath:ctx-story-test-main.xml"], classes = [], contextInitializerClasses = [], activeProfiles = [], propertySourceDescriptors = [], propertySourceProperties = [], contextCustomizers = [], contextLoader = org.springframework.test.context.support.DelegatingSmartContextLoader, parent = null]
[ERROR] TestLdapVirtualGroup>AbstractTestNGSpringContextTests.springTestContextPrepareTestInstance:119 » IllegalState ApplicationContext failure threshold (1) exceeded: skipping repeated attempt to load context for [MergedContextConfiguration at 589a2887 testClass = com.evolveum.midpoint.testing.story.ldap.TestLdapVirtualGroup, locations = ["classpath:ctx-story-test-main.xml"], classes = [], contextInitializerClasses = [], activeProfiles = [], propertySourceDescriptors = [], propertySourceProperties = [], contextCustomizers = [], contextLoader = org.springframework.test.context.support.DelegatingSmartContextLoader, parent = null]
[ERROR] TestLdapDeeplyHierarchical>AbstractTestNGSpringContextTests.springTestContextPrepareTestInstance:119 » IllegalState ApplicationContext failure threshold (1) exceeded: skipping repeated attempt to load context for [MergedContextConfiguration at 425d1456 testClass = com.evolveum.midpoint.testing.story.ldap.hierarchy.TestLdapDeeplyHierarchical, locations = ["classpath:ctx-story-test-main.xml"], classes = [], contextInitializerClasses = [], activeProfiles = [], propertySourceDescriptors = [], propertySourceProperties = [], contextCustomizers = [], contextLoader = org.springframework.test.context.support.DelegatingSmartContextLoader, parent = null]
[ERROR] TestLdapFlat>AbstractTestNGSpringContextTests.springTestContextPrepareTestInstance:119 » IllegalState ApplicationContext failure threshold (1) exceeded: skipping repeated attempt to load context for [MergedContextConfiguration at 15f4d097 testClass = com.evolveum.midpoint.testing.story.ldap.hierarchy.TestLdapFlat, locations = ["classpath:ctx-story-test-main.xml"], classes = [], contextInitializerClasses = [], activeProfiles = [], propertySourceDescriptors = [], propertySourceProperties = [], contextCustomizers = [], contextLoader = org.springframework.test.context.support.DelegatingSmartContextLoader, parent = null]
[ERROR] TestLdapHierarchical>AbstractTestNGSpringContextTests.springTestContextPrepareTestInstance:119 » IllegalState ApplicationContext failure threshold (1) exceeded: skipping repeated attempt to load context for [MergedContextConfiguration at 212953f2 testClass = com.evolveum.midpoint.testing.story.ldap.hierarchy.TestLdapHierarchical, locations = ["classpath:ctx-story-test-main.xml"], classes = [], contextInitializerClasses = [], activeProfiles = [], propertySourceDescriptors = [], propertySourceProperties = [], contextCustomizers = [], contextLoader = org.springframework.test.context.support.DelegatingSmartContextLoader, parent = null]
[ERROR] TestLdapNested>AbstractTestNGSpringContextTests.springTestContextPrepareTestInstance:119 » IllegalState ApplicationContext failure threshold (1) exceeded: skipping repeated attempt to load context for [MergedContextConfiguration at 7c76669b testClass = com.evolveum.midpoint.testing.story.ldap.hierarchy.TestLdapNested, locations = ["classpath:ctx-story-test-main.xml"], classes = [], contextInitializerClasses = [], activeProfiles = [], propertySourceDescriptors = [], propertySourceProperties = [], contextCustomizers = [], contextLoader = org.springframework.test.context.support.DelegatingSmartContextLoader, parent = null]
[ERROR] TestNotoriousOrg>AbstractTestNGSpringContextTests.springTestContextPrepareTestInstance:119 » IllegalState ApplicationContext failure threshold (1) exceeded: skipping repeated attempt to load context for [MergedContextConfiguration at 45fc6bb6 testClass = com.evolveum.midpoint.testing.story.notorious.TestNotoriousOrg, locations = ["classpath:ctx-story-test-main.xml"], classes = [], contextInitializerClasses = [], activeProfiles = [], propertySourceDescriptors = [], propertySourceProperties = [], contextCustomizers = [], contextLoader = org.springframework.test.context.support.DelegatingSmartContextLoader, parent = null]
[ERROR] TestNotoriousRole>AbstractTestNGSpringContextTests.springTestContextPrepareTestInstance:119 » IllegalState ApplicationContext failure threshold (1) exceeded: skipping repeated attempt to load context for [MergedContextConfiguration at 5bfb78ab testClass = com.evolveum.midpoint.testing.story.notorious.TestNotoriousRole, locations = ["classpath:ctx-story-test-main.xml"], classes = [], contextInitializerClasses = [], activeProfiles = [], propertySourceDescriptors = [], propertySourceProperties = [], contextCustomizers = [], contextLoader = org.springframework.test.context.support.DelegatingSmartContextLoader, parent = null]
[ERROR] TestPrivacy>AbstractTestNGSpringContextTests.springTestContextPrepareTestInstance:119 » IllegalState ApplicationContext failure threshold (1) exceeded: skipping repeated attempt to load context for [MergedContextConfiguration at 15845d96 testClass = com.evolveum.midpoint.testing.story.security.TestPrivacy, locations = ["classpath:ctx-story-test-main.xml"], classes = [], contextInitializerClasses = [], activeProfiles = [], propertySourceDescriptors = [], propertySourceProperties = [], contextCustomizers = [], contextLoader = org.springframework.test.context.support.DelegatingSmartContextLoader, parent = null]
[ERROR] TestRoleMembers>AbstractTestNGSpringContextTests.springTestContextPrepareTestInstance:119 » IllegalState ApplicationContext failure threshold (1) exceeded: skipping repeated attempt to load context for [MergedContextConfiguration at 74d9e7f9 testClass = com.evolveum.midpoint.testing.story.security.TestRoleMembers, locations = ["classpath:ctx-story-test-main.xml"], classes = [], contextInitializerClasses = [], activeProfiles = [], propertySourceDescriptors = [], propertySourceProperties = [], contextCustomizers = [], contextLoader = org.springframework.test.context.support.DelegatingSmartContextLoader, parent = null]
[ERROR] TestUuidClient>AbstractTestNGSpringContextTests.springTestContextPrepareTestInstance:119 » IllegalState ApplicationContext failure threshold (1) exceeded: skipping repeated attempt to load context for [MergedContextConfiguration at 2c6e0752 testClass = com.evolveum.midpoint.testing.story.uuid.TestUuidClient, locations = ["classpath:ctx-story-test-main.xml"], classes = [], contextInitializerClasses = [], activeProfiles = [], propertySourceDescriptors = [], propertySourceProperties = [], contextCustomizers = [], contextLoader = org.springframework.test.context.support.DelegatingSmartContextLoader, parent = null]
[ERROR] TestUuidExtension>AbstractTestNGSpringContextTests.springTestContextPrepareTestInstance:119 » IllegalState ApplicationContext failure threshold (1) exceeded: skipping repeated attempt to load context for [MergedContextConfiguration at 1e866370 testClass = com.evolveum.midpoint.testing.story.uuid.TestUuidExtension, locations = ["classpath:ctx-story-test-main.xml"], classes = [], contextInitializerClasses = [], activeProfiles = [], propertySourceDescriptors = [], propertySourceProperties = [], contextCustomizers = [], contextLoader = org.springframework.test.context.support.DelegatingSmartContextLoader, parent = null]
[INFO]
[ERROR] Tests run: 1531, Failures: 68, Errors: 0, Skipped: 1463
[INFO]
[INFO]
[INFO] --- failsafe:3.1.2:verify (integration-test) @ story ---
[ERROR] There are test failures.
Please refer to /home/jenkins/agent/workspace/midpoint-support-4-8-generic-oracle23-jdk21/testing/story/target/failsafe-reports for the individual test results.
Please refer to dump files (if any exist) [date].dump, [date]-jvmRun[N].dump and [date].dumpstream.
[INFO]
[INFO] --- dependency:3.3.0:analyze-only (analyze) @ story ---
[INFO] No dependency problems found
[INFO]
[INFO] -----------------< com.evolveum.midpoint.testing:rest >-----------------
[INFO] Building midPoint Testing - REST API 4.8.7-SNAPSHOT [5/5]
[INFO] from rest/pom.xml
[INFO] --------------------------------[ jar ]---------------------------------
[INFO]
[INFO] --- enforcer:3.4.1:enforce (enforce) @ rest ---
[INFO] Rule 1: org.apache.maven.enforcer.rules.dependency.DependencyConvergence passed
[INFO] Rule 2: org.apache.maven.enforcer.rules.dependency.BannedDependencies passed
[INFO]
[INFO] --- checkstyle:3.1.2:check (validate) @ rest ---
[INFO] Starting audit...
Audit done.
[INFO] You have 0 Checkstyle violations.
[INFO]
[INFO] --- gitdescribe:3.0:gitdescribe (git-describe) @ rest ---
[INFO] Setting Git Describe: v4.8.7devel-3-gb68a66bae3f
[INFO]
[INFO] --- resources:3.1.0:resources (default-resources) @ rest ---
[INFO] Using 'UTF-8' encoding to copy filtered resources.
[INFO] skip non existing resourceDirectory /home/jenkins/agent/workspace/midpoint-support-4-8-generic-oracle23-jdk21/testing/rest/src/main/resources
[INFO]
[INFO] --- compiler:3.11.0:compile (default-compile) @ rest ---
[INFO] No sources to compile
[INFO]
[INFO] --- resources:3.1.0:testResources (default-testResources) @ rest ---
[INFO] Using 'UTF-8' encoding to copy filtered resources.
[INFO] Copying 145 resources
[INFO]
[INFO] --- compiler:3.11.0:testCompile (default-testCompile) @ rest ---
[INFO] Nothing to compile - all classes are up to date
[INFO]
[INFO] --- surefire:3.1.2:test (default-test) @ rest ---
[INFO] Tests are skipped.
[INFO]
[INFO] --- jar:3.4.2:jar (default-jar) @ rest ---
[INFO] Skipping packaging of the jar
[INFO]
[INFO] >>> source:3.1.0:jar (attach-sources) > generate-sources @ rest >>>
[INFO]
[INFO] --- enforcer:3.4.1:enforce (enforce) @ rest ---
[INFO] Rule 1: org.apache.maven.enforcer.rules.dependency.DependencyConvergence passed
[INFO] Rule 2: org.apache.maven.enforcer.rules.dependency.BannedDependencies passed
[INFO]
[INFO] --- checkstyle:3.1.2:check (validate) @ rest ---
[INFO] Starting audit...
Audit done.
[INFO] You have 0 Checkstyle violations.
[INFO]
[INFO] --- gitdescribe:3.0:gitdescribe (git-describe) @ rest ---
[INFO]
[INFO] <<< source:3.1.0:jar (attach-sources) < generate-sources @ rest <<<
[INFO]
[INFO]
[INFO] --- source:3.1.0:jar (attach-sources) @ rest ---
[INFO] No sources in project. Archive not created.
[INFO]
[INFO] --- failsafe:3.1.2:integration-test (integration-test) @ rest ---
[INFO] Using configured provider org.apache.maven.surefire.testng.TestNGProvider
[INFO]
[INFO] -------------------------------------------------------
[INFO] T E S T S
[INFO] -------------------------------------------------------
[INFO] Running Integration
[INFO] Tests run: 272, Failures: 0, Errors: 0, Skipped: 0, Time elapsed: 395.8 s -- in Integration
[INFO]
[INFO] Results:
[INFO]
[INFO] Tests run: 272, Failures: 0, Errors: 0, Skipped: 0
[INFO]
[INFO]
[INFO] --- failsafe:3.1.2:verify (integration-test) @ rest ---
[INFO]
[INFO] --- dependency:3.3.0:analyze-only (analyze) @ rest ---
[INFO] No dependency problems found
[INFO] ------------------------------------------------------------------------
[INFO] Reactor Summary for midPoint Testing Infrastructure 4.8.7-SNAPSHOT:
[INFO]
[INFO] midPoint Testing Infrastructure .................... SUCCESS [ 2.269 s]
[INFO] midPoint Testing - Resource Connection Tests ....... SUCCESS [ 5.386 s]
[INFO] midPoint Testing - Long Tests ...................... SUCCESS [ 32.094 s]
[INFO] midPoint Testing - Story Tests ..................... SUCCESS [ 39.560 s]
[INFO] midPoint Testing - REST API ........................ SUCCESS [06:38 min]
[INFO] ------------------------------------------------------------------------
[INFO] BUILD SUCCESS
[INFO] ------------------------------------------------------------------------
[INFO] Total time: 07:58 min
[INFO] Finished at: 2025-02-04T18:02:10Z
[INFO] ------------------------------------------------------------------------
+ '[' 0 -ge 1 ']'
[Pipeline] }
[Pipeline] // container
[Pipeline] }
[Pipeline] // stage
[Pipeline] stage
[Pipeline] { (collect-test-results)
[Pipeline] container
[Pipeline] {
[Pipeline] testNG
TestNG Reports Processing: START
Looking for TestNG results report in workspace using pattern: **/testng-results.xml
Saving reports...
Processing '/var/jenkins_home/jobs/midpoint-support-4-8-generic-oracle23-jdk21/builds/9/testng/testng-results-1.xml'
Processing '/var/jenkins_home/jobs/midpoint-support-4-8-generic-oracle23-jdk21/builds/9/testng/testng-results-10.xml'
Processing '/var/jenkins_home/jobs/midpoint-support-4-8-generic-oracle23-jdk21/builds/9/testng/testng-results-11.xml'
Processing '/var/jenkins_home/jobs/midpoint-support-4-8-generic-oracle23-jdk21/builds/9/testng/testng-results-12.xml'
Processing '/var/jenkins_home/jobs/midpoint-support-4-8-generic-oracle23-jdk21/builds/9/testng/testng-results-13.xml'
Processing '/var/jenkins_home/jobs/midpoint-support-4-8-generic-oracle23-jdk21/builds/9/testng/testng-results-14.xml'
Processing '/var/jenkins_home/jobs/midpoint-support-4-8-generic-oracle23-jdk21/builds/9/testng/testng-results-15.xml'
Processing '/var/jenkins_home/jobs/midpoint-support-4-8-generic-oracle23-jdk21/builds/9/testng/testng-results-16.xml'
Processing '/var/jenkins_home/jobs/midpoint-support-4-8-generic-oracle23-jdk21/builds/9/testng/testng-results-17.xml'
Processing '/var/jenkins_home/jobs/midpoint-support-4-8-generic-oracle23-jdk21/builds/9/testng/testng-results-18.xml'
Processing '/var/jenkins_home/jobs/midpoint-support-4-8-generic-oracle23-jdk21/builds/9/testng/testng-results-19.xml'
Processing '/var/jenkins_home/jobs/midpoint-support-4-8-generic-oracle23-jdk21/builds/9/testng/testng-results-2.xml'
Processing '/var/jenkins_home/jobs/midpoint-support-4-8-generic-oracle23-jdk21/builds/9/testng/testng-results-20.xml'
Processing '/var/jenkins_home/jobs/midpoint-support-4-8-generic-oracle23-jdk21/builds/9/testng/testng-results-21.xml'
Processing '/var/jenkins_home/jobs/midpoint-support-4-8-generic-oracle23-jdk21/builds/9/testng/testng-results-22.xml'
Processing '/var/jenkins_home/jobs/midpoint-support-4-8-generic-oracle23-jdk21/builds/9/testng/testng-results-23.xml'
Processing '/var/jenkins_home/jobs/midpoint-support-4-8-generic-oracle23-jdk21/builds/9/testng/testng-results-24.xml'
Processing '/var/jenkins_home/jobs/midpoint-support-4-8-generic-oracle23-jdk21/builds/9/testng/testng-results-25.xml'
Processing '/var/jenkins_home/jobs/midpoint-support-4-8-generic-oracle23-jdk21/builds/9/testng/testng-results-26.xml'
Processing '/var/jenkins_home/jobs/midpoint-support-4-8-generic-oracle23-jdk21/builds/9/testng/testng-results-27.xml'
Processing '/var/jenkins_home/jobs/midpoint-support-4-8-generic-oracle23-jdk21/builds/9/testng/testng-results-28.xml'
Processing '/var/jenkins_home/jobs/midpoint-support-4-8-generic-oracle23-jdk21/builds/9/testng/testng-results-29.xml'
Processing '/var/jenkins_home/jobs/midpoint-support-4-8-generic-oracle23-jdk21/builds/9/testng/testng-results-3.xml'
Processing '/var/jenkins_home/jobs/midpoint-support-4-8-generic-oracle23-jdk21/builds/9/testng/testng-results-30.xml'
Processing '/var/jenkins_home/jobs/midpoint-support-4-8-generic-oracle23-jdk21/builds/9/testng/testng-results-31.xml'
Processing '/var/jenkins_home/jobs/midpoint-support-4-8-generic-oracle23-jdk21/builds/9/testng/testng-results-32.xml'
Processing '/var/jenkins_home/jobs/midpoint-support-4-8-generic-oracle23-jdk21/builds/9/testng/testng-results-33.xml'
Processing '/var/jenkins_home/jobs/midpoint-support-4-8-generic-oracle23-jdk21/builds/9/testng/testng-results-34.xml'
Processing '/var/jenkins_home/jobs/midpoint-support-4-8-generic-oracle23-jdk21/builds/9/testng/testng-results-35.xml'
Processing '/var/jenkins_home/jobs/midpoint-support-4-8-generic-oracle23-jdk21/builds/9/testng/testng-results-4.xml'
Processing '/var/jenkins_home/jobs/midpoint-support-4-8-generic-oracle23-jdk21/builds/9/testng/testng-results-5.xml'
Processing '/var/jenkins_home/jobs/midpoint-support-4-8-generic-oracle23-jdk21/builds/9/testng/testng-results-6.xml'
Processing '/var/jenkins_home/jobs/midpoint-support-4-8-generic-oracle23-jdk21/builds/9/testng/testng-results-7.xml'
Processing '/var/jenkins_home/jobs/midpoint-support-4-8-generic-oracle23-jdk21/builds/9/testng/testng-results-8.xml'
Processing '/var/jenkins_home/jobs/midpoint-support-4-8-generic-oracle23-jdk21/builds/9/testng/testng-results-9.xml'
Processing '/var/jenkins_home/jobs/midpoint-support-4-8-generic-oracle23-jdk21/builds/9/testng/testng-results.xml'
Failed configuration methods found. Marking build as FAILURE.
TestNG Reports Processing: FINISH
[Pipeline] }
[Pipeline] // container
[Pipeline] }
[Pipeline] // stage
[Pipeline] container
[Pipeline] {
[Pipeline] withKubeConfig
[Pipeline] {
[Pipeline] sh
pod "test-db-midpoint-support-4-8-generic-oracle23-jdk21-9" deleted
persistentvolumeclaim "test-db-midpoint-support-4-8-generic-oracle23-jdk21-9" deleted
[Pipeline] }
[kubernetes-cli] kubectl configuration cleaned up
[Pipeline] // withKubeConfig
[Pipeline] }
[Pipeline] // container
[Pipeline] step
More information about the midPoint-ci
mailing list