[midPoint-ci] Build failed in Jenkins: midPoint - support 4.8 - Generic repo, Oracle 21c XE, JDK 21 (Eclipse Temurin) #102

Jenkins noreply at evolveum.com
Sat May 4 21:36:08 CEST 2024


See <https://jenkins.evolveum.com/job/midpoint-support-4-8-generic-oracle-jdk21/102/display/redirect>

Changes:


------------------------------------------
[...truncated 4666 lines...]
[INFO] <s> [webpack.Progress] 92% sealing asset processing RealContentHashPlugin
[INFO] <s> [webpack.Progress] 92% sealing asset processing
[INFO] <s> [webpack.Progress] 93% sealing after asset optimization
[INFO] <s> [webpack.Progress] 93% sealing after asset optimization
[INFO] <s> [webpack.Progress] 93% sealing recording
[INFO] <s> [webpack.Progress] 93% sealing recording
[INFO] <s> [webpack.Progress] 94% sealing after seal
[INFO] <s> [webpack.Progress] 94% sealing after seal
[INFO] <s> [webpack.Progress] 95% emitting emit
[INFO] <s> [webpack.Progress] 95% emitting emit
[INFO] <s> [webpack.Progress] 98% emitting after emit
[INFO] <s> [webpack.Progress] 98% emitting after emit SizeLimitsPlugin
[INFO] <s> [webpack.Progress] 98% emitting after emit
[INFO] <s> [webpack.Progress] 99% done plugins
[INFO] <s> [webpack.Progress] 99% done plugins
[INFO] <s> [webpack.Progress] 99% 
[INFO] 
[INFO] <s> [webpack.Progress] 99% cache store build dependencies
[INFO] <s> [webpack.Progress] 99% cache store build dependencies
[INFO] <s> [webpack.Progress] 99% cache begin idle
[INFO] <s> [webpack.Progress] 99% cache begin idle
[INFO] <s> [webpack.Progress] 100% 
[INFO] 
[INFO] <s> [webpack.Progress] 99% cache shutdown
[INFO] <s> [webpack.Progress] 99% cache shutdown
[INFO] <s> [webpack.Progress] 100% 
[INFO] 
[INFO] assets by path ./*.js 3.44 MiB
[INFO]   assets by status 3.23 MiB [big]
[INFO]     asset ./vendors-passwords.js 1.85 MiB [emitted] [minimized] [big] (name: vendors-passwords)
[INFO]     asset ./vendors.js 1.39 MiB [emitted] [minimized] [big] (name: vendors) 1 related asset
[INFO]   asset ./midpoint.js 191 KiB [emitted] [minimized] (name: midpoint) 1 related asset
[INFO]   asset ./492.js 19.9 KiB [emitted] [minimized] (id hint: vendors)
[INFO]   asset ./vendors-fonts.js 0 bytes [emitted] [minimized] (name: vendors-fonts)
[INFO] assets by path *.css 14.1 MiB
[INFO]   asset vendors.css 7.77 MiB [emitted] [minimized] [big] (name: vendors)
[INFO]   asset vendors-fonts.css 6.28 MiB [emitted] [minimized] [big] (name: vendors-fonts)
[INFO]   asset midpoint.css 66.9 KiB [emitted] [minimized] (name: midpoint)
[INFO] asset worker-xml.js 43.9 KiB [emitted] [from: node_modules/ace-builds/src-noconflict/worker-xml.js] [minimized] (auxiliary name: vendors)
[INFO] asset img/midpoint_logo_white_180.png 5.95 KiB [emitted] [from: src/frontend/img/midpoint_logo_white_180.png] (auxiliary name: midpoint)
[INFO] Entrypoint vendors [big] 9.16 MiB (43.9 KiB) = vendors.css 7.77 MiB ./vendors.js 1.39 MiB 1 auxiliary asset
[INFO] Entrypoint vendors-passwords [big] 1.85 MiB = ./vendors-passwords.js
[INFO] Entrypoint vendors-fonts [big] 6.28 MiB = vendors-fonts.css 6.28 MiB ./vendors-fonts.js 0 bytes
[INFO] Entrypoint midpoint 257 KiB (5.95 KiB) = midpoint.css 66.9 KiB ./midpoint.js 191 KiB 1 auxiliary asset
[INFO] orphan modules 11 MiB (javascript) 5.95 KiB (asset) 3.02 KiB (runtime) [orphan] 743 modules
[INFO] runtime modules 12.4 KiB 24 modules
[INFO] built modules 5.56 MiB (javascript) 14.8 MiB (css/mini-extract) [built]
[INFO]   modules by path ./node_modules/moment/ 1.21 MiB 274 modules
[INFO]   css modules 14.8 MiB
[INFO]     modules by path ./node_modules/ 13.2 MiB 14 modules
[INFO]     modules by path ./src/frontend/ 1.63 MiB 3 modules
[INFO]   modules by path ./src/frontend/js/ 2.49 MiB 7 modules
[INFO]   modules by path ./node_modules/ace-builds/src-noconflict/*.js 825 KiB
[INFO]     ./node_modules/ace-builds/src-noconflict/ace.js 704 KiB [built] [code generated]
[INFO]       617 ms ->
[INFO]       0 ms (resolving: 0 ms, restoring: 0 ms, integration: 0 ms, building: 0 ms, storing: 0 ms)
[INFO]     + 6 modules
[INFO]   modules by path ./node_modules/admin-lte/ 262 KiB
[INFO]     ./node_modules/admin-lte/plugins/bootstrap/js/bootstrap.js 134 KiB [built] [code generated]
[INFO]       617 ms ->
[INFO]       0 ms (resolving: 0 ms, restoring: 0 ms, integration: 0 ms, building: 0 ms, storing: 0 ms)
[INFO]     + 2 modules
[INFO]   + 12 modules
[INFO] 
[INFO] LOG from webpack.Compilation.ModuleProfile
[INFO] <i>  | 392 ms (parallelism 13.4) resolve to new modules > ./node_modules/@popperjs/core/lib/index.js
[INFO] <i>  | 413 ms (parallelism 13.3) resolve to new modules > ./node_modules/@eonasdan/tempus-dominus/dist/js/tempus-dominus.esm.js
[INFO] <i> 1625 ms resolve to new modules
[INFO] <i>  | 392 ms (parallelism 13.1) resolve to existing modules > ./node_modules/@eonasdan/tempus-dominus/dist/js/tempus-dominus.esm.js
[INFO] <i> 660 ms resolve to existing modules
[INFO] <i>  |  | 391 ms (parallelism 13.4) build modules > ./src/frontend/js/password-score/password-score-options.js
[INFO] <i>  | 708 ms build modules > 9 x javascript/auto with ./node_modules/babel-loader/lib/index.js
[INFO] <e>  |  | 1073 ms (parallelism 15.4) build modules > ./src/frontend/scss/vendors.scss
[INFO] <e>  |  | 1025 ms (parallelism 14.9) build modules > ./src/frontend/scss/vendors-fonts.scss
[INFO] <w>  |  | 925 ms (parallelism 15.4) build modules > ./src/frontend/scss/midpoint.scss
[INFO] <e>  | 3024 ms build modules > 3 x javascript/auto with ./node_modules/mini-css-extract-plugin/dist/loader.js!./node_modules/css-loader/dist/cjs.js??ruleSet[1].rules[0].use[1]!./node_modules/postcss-loader/dist/cjs.js!./node_modules/sass-loader/dist/cjs.js??ruleSet[1].rules[0].use[3]
[INFO] <w>  |  | 980 ms (parallelism 15) build modules > ./src/frontend/scss/vendors.scss.webpack[javascript/auto]!=!./node_modules/css-loader/dist/cjs.js??ruleSet[1].rules[0].use[1]!./node_modules/postcss-loader/dist/cjs.js!./node_modules/sass-loader/dist/cjs.js??ruleSet[1].rules[0].use[3]!./src/frontend/scss/vendors.scss
[INFO] <i>  |  | 345 ms (parallelism 20.7) build modules > ./src/frontend/scss/vendors-fonts.scss.webpack[javascript/auto]!=!./node_modules/css-loader/dist/cjs.js??ruleSet[1].rules[0].use[1]!./node_modules/postcss-loader/dist/cjs.js!./node_modules/sass-loader/dist/cjs.js??ruleSet[1].rules[0].use[3]!./src/frontend/scss/vendors-fonts.scss
[INFO] <w>  |  | 886 ms (parallelism 15.5) build modules > ./src/frontend/scss/midpoint.scss.webpack[javascript/auto]!=!./node_modules/css-loader/dist/cjs.js??ruleSet[1].rules[0].use[1]!./node_modules/postcss-loader/dist/cjs.js!./node_modules/sass-loader/dist/cjs.js??ruleSet[1].rules[0].use[3]!./src/frontend/scss/midpoint.scss
[INFO] <w>  |  | 722 ms (parallelism 9.9) build modules > ./node_modules/css-loader/dist/cjs.js??ruleSet[1].rules[0].use[1]!./node_modules/postcss-loader/dist/cjs.js!./node_modules/sass-loader/dist/cjs.js??ruleSet[1].rules[0].use[3]!./node_modules/@fontsource/source-sans-pro/300.css
[INFO] <w>  |  | 723 ms (parallelism 9.9) build modules > ./node_modules/css-loader/dist/cjs.js??ruleSet[1].rules[0].use[1]!./node_modules/postcss-loader/dist/cjs.js!./node_modules/sass-loader/dist/cjs.js??ruleSet[1].rules[0].use[3]!./node_modules/@fontsource/source-sans-pro/400.css
[INFO] <w>  |  | 723 ms (parallelism 9.9) build modules > ./node_modules/css-loader/dist/cjs.js??ruleSet[1].rules[0].use[1]!./node_modules/postcss-loader/dist/cjs.js!./node_modules/sass-loader/dist/cjs.js??ruleSet[1].rules[0].use[3]!./node_modules/@fontsource/source-sans-pro/400-italic.css
[INFO] <w>  |  | 723 ms (parallelism 9.9) build modules > ./node_modules/css-loader/dist/cjs.js??ruleSet[1].rules[0].use[1]!./node_modules/postcss-loader/dist/cjs.js!./node_modules/sass-loader/dist/cjs.js??ruleSet[1].rules[0].use[3]!./node_modules/@fontsource/source-sans-pro/700.css
[INFO] <w>  |  | 783 ms (parallelism 9.6) build modules > ./node_modules/css-loader/dist/cjs.js??ruleSet[1].rules[0].use[1]!./node_modules/postcss-loader/dist/cjs.js!./node_modules/sass-loader/dist/cjs.js??ruleSet[1].rules[0].use[3]!./node_modules/@fortawesome/fontawesome-free/css/all.css
[INFO] <w>  | 6268 ms build modules > 17 x javascript/auto with ./node_modules/css-loader/dist/cjs.js??ruleSet[1].rules[0].use[1]!./node_modules/postcss-loader/dist/cjs.js!./node_modules/sass-loader/dist/cjs.js??ruleSet[1].rules[0].use[3]
[INFO] <i>  |  | 364 ms (parallelism 13.1) build modules > ./node_modules/select2/dist/js/select2.js
[INFO] <i>  | 800 ms build modules > 350 x javascript/auto
[INFO] <i>  |  | 305 ms (parallelism 12.9) build modules > ./node_modules/sparklines/source/sparkline.mjs
[INFO] <i>  | 305 ms build modules > 1 x javascript/esm
[INFO] <e> 11271 ms build modules
[INFO] + 32 hidden lines
[INFO] 
[INFO] WARNING in ./src/frontend/js/midpoint.js 13:16-22
[INFO] export 'default' (imported as 'Popper') was not found in '@popperjs/core' (possible exports: afterMain, afterRead, afterWrite, applyStyles, arrow, auto, basePlacements, beforeMain, beforeRead, beforeWrite, bottom, clippingParents, computeStyles, createPopper, createPopperBase, createPopperLite, detectOverflow, end, eventListeners, flip, hide, left, main, modifierPhases, offset, placements, popper, popperGenerator, popperOffsets, preventOverflow, read, reference, right, start, top, variationPlacements, viewport, write)
[INFO] 
[INFO] webpack 5.76.0 compiled with 1 warning in 57757 ms
[INFO] 
[INFO] --- resources:3.1.0:resources (default-resources) @ admin-gui ---
[INFO] Using 'UTF-8' encoding to copy filtered resources.
[INFO] Copying 54 resources
[INFO] Copying 1 resource
[INFO] Copying 1 resource to META-INF/services
[INFO] Copying 630 resources
[INFO] Copying 0 resource
[INFO] Copying 12 resources
[INFO] 
[INFO] --- compiler:3.11.0:compile (default-compile) @ admin-gui ---
[INFO] Changes detected - recompiling the module! :dependency
[INFO] Compiling 1733 source files with javac [debug target 17] to target/classes
[INFO] /home/jenkins/agent/workspace/midpoint-support-4-8-generic-oracle-jdk21/gui/admin-gui/src/main/java/com/evolveum/midpoint/web/component/data/BoxedTablePanel.java: Some input files use or override a deprecated API.
[INFO] /home/jenkins/agent/workspace/midpoint-support-4-8-generic-oracle-jdk21/gui/admin-gui/src/main/java/com/evolveum/midpoint/web/component/data/BoxedTablePanel.java: Recompile with -Xlint:deprecation for details.
[INFO] /home/jenkins/agent/workspace/midpoint-support-4-8-generic-oracle-jdk21/gui/admin-gui/src/main/java/com/evolveum/midpoint/gui/impl/component/wizard/AbstractWizardBasicPanel.java: Some input files use unchecked or unsafe operations.
[INFO] /home/jenkins/agent/workspace/midpoint-support-4-8-generic-oracle-jdk21/gui/admin-gui/src/main/java/com/evolveum/midpoint/gui/impl/component/wizard/AbstractWizardBasicPanel.java: Recompile with -Xlint:unchecked for details.
[INFO] -------------------------------------------------------------
[WARNING] COMPILATION WARNING : 
[INFO] -------------------------------------------------------------
[WARNING] system modules path not set in conjunction with -source 17
[WARNING] /home/jenkins/agent/workspace/midpoint-support-4-8-generic-oracle-jdk21/gui/admin-gui/src/main/java/com/evolveum/midpoint/gui/impl/page/admin/resource/component/ResourceTasksPanel.java:[9,61] com.evolveum.midpoint.web.page.admin.resources.ResourceContentPanel in com.evolveum.midpoint.web.page.admin.resources has been deprecated and marked for removal
[WARNING] /home/jenkins/agent/workspace/midpoint-support-4-8-generic-oracle-jdk21/gui/admin-gui/src/main/java/com/evolveum/midpoint/gui/impl/page/admin/resource/component/ResourceContentPanel.java:[610,59] com.evolveum.midpoint.web.page.admin.resources.ResourceContentPanel in com.evolveum.midpoint.web.page.admin.resources has been deprecated and marked for removal
[WARNING] /home/jenkins/agent/workspace/midpoint-support-4-8-generic-oracle-jdk21/gui/admin-gui/src/main/java/com/evolveum/midpoint/gui/impl/page/admin/resource/component/ResourceContentPanel.java:[618,13] com.evolveum.midpoint.web.page.admin.resources.ResourceContentResourcePanel in com.evolveum.midpoint.web.page.admin.resources has been deprecated and marked for removal
[WARNING] /home/jenkins/agent/workspace/midpoint-support-4-8-generic-oracle-jdk21/gui/admin-gui/src/main/java/com/evolveum/midpoint/gui/impl/page/admin/resource/component/ResourceContentPanel.java:[621,9] com.evolveum.midpoint.web.page.admin.resources.ResourceContentResourcePanel in com.evolveum.midpoint.web.page.admin.resources has been deprecated and marked for removal
[WARNING] /home/jenkins/agent/workspace/midpoint-support-4-8-generic-oracle-jdk21/gui/admin-gui/src/main/java/com/evolveum/midpoint/gui/impl/page/admin/resource/component/ResourceContentPanel.java:[621,60] com.evolveum.midpoint.web.page.admin.resources.ResourceContentResourcePanel in com.evolveum.midpoint.web.page.admin.resources has been deprecated and marked for removal
[WARNING] /home/jenkins/agent/workspace/midpoint-support-4-8-generic-oracle-jdk21/gui/admin-gui/src/main/java/com/evolveum/midpoint/web/page/admin/resources/ResourceContentResourcePanel.java:[24,51] com.evolveum.midpoint.web.page.admin.resources.ResourceContentPanel in com.evolveum.midpoint.web.page.admin.resources has been deprecated and marked for removal
[WARNING] /home/jenkins/agent/workspace/midpoint-support-4-8-generic-oracle-jdk21/gui/admin-gui/src/main/java/com/evolveum/midpoint/gui/impl/page/admin/resource/component/ResourceContentPanel.java:[666,13] com.evolveum.midpoint.web.page.admin.resources.ResourceContentRepositoryPanel in com.evolveum.midpoint.web.page.admin.resources has been deprecated and marked for removal
[WARNING] /home/jenkins/agent/workspace/midpoint-support-4-8-generic-oracle-jdk21/gui/admin-gui/src/main/java/com/evolveum/midpoint/gui/impl/page/admin/resource/component/ResourceContentPanel.java:[669,9] com.evolveum.midpoint.web.page.admin.resources.ResourceContentRepositoryPanel in com.evolveum.midpoint.web.page.admin.resources has been deprecated and marked for removal
[WARNING] /home/jenkins/agent/workspace/midpoint-support-4-8-generic-oracle-jdk21/gui/admin-gui/src/main/java/com/evolveum/midpoint/gui/impl/page/admin/resource/component/ResourceContentPanel.java:[669,64] com.evolveum.midpoint.web.page.admin.resources.ResourceContentRepositoryPanel in com.evolveum.midpoint.web.page.admin.resources has been deprecated and marked for removal
[WARNING] /home/jenkins/agent/workspace/midpoint-support-4-8-generic-oracle-jdk21/gui/admin-gui/src/main/java/com/evolveum/midpoint/web/page/admin/resources/ResourceContentRepositoryPanel.java:[39,53] com.evolveum.midpoint.web.page.admin.resources.ResourceContentPanel in com.evolveum.midpoint.web.page.admin.resources has been deprecated and marked for removal
[WARNING] /home/jenkins/agent/workspace/midpoint-support-4-8-generic-oracle-jdk21/gui/admin-gui/src/main/java/com/evolveum/midpoint/gui/impl/page/admin/resource/component/ResourceContentPanel.java:[784,55] com.evolveum.midpoint.web.page.admin.resources.ResourceContentPanel in com.evolveum.midpoint.web.page.admin.resources has been deprecated and marked for removal
[WARNING] /home/jenkins/agent/workspace/midpoint-support-4-8-generic-oracle-jdk21/gui/admin-gui/src/main/java/com/evolveum/midpoint/gui/impl/page/admin/resource/component/ResourceContentPanel.java:[785,64] com.evolveum.midpoint.web.page.admin.resources.ResourceContentPanel in com.evolveum.midpoint.web.page.admin.resources has been deprecated and marked for removal
[WARNING] /home/jenkins/agent/workspace/midpoint-support-4-8-generic-oracle-jdk21/gui/admin-gui/src/main/java/com/evolveum/midpoint/gui/impl/component/input/SourceMappingProvider.java:[101,101] non-varargs call of varargs method with inexact argument type for last parameter;
  cast to java.lang.Object for a varargs call
  cast to java.lang.Object[] for a non-varargs call and to suppress this warning
[INFO] 14 warnings 
[INFO] -------------------------------------------------------------
[INFO] -------------------------------------------------------------
[ERROR] COMPILATION ERROR : 
[INFO] -------------------------------------------------------------
[ERROR] /home/jenkins/agent/workspace/midpoint-support-4-8-generic-oracle-jdk21/gui/admin-gui/src/main/java/com/evolveum/midpoint/gui/impl/component/search/panel/SingleSearchItemPanel.java:[97,39] cannot find symbol
  symbol:   class VisibleEnableBehaviour
  location: class com.evolveum.midpoint.gui.impl.component.search.panel.SingleSearchItemPanel<S>
[ERROR] /home/jenkins/agent/workspace/midpoint-support-4-8-generic-oracle-jdk21/gui/admin-gui/src/main/java/com/evolveum/midpoint/gui/impl/component/search/panel/SingleSearchItemPanel.java:[101,17] method does not override or implement a method from a supertype
[INFO] 2 errors 
[INFO] -------------------------------------------------------------
[INFO] ------------------------------------------------------------------------
[INFO] Reactor Summary for midPoint Project 4.8.3-SNAPSHOT:
[INFO] 
[INFO] midPoint Project ................................... SUCCESS [ 17.048 s]
[INFO] midPoint Infrastructure ............................ SUCCESS [  0.238 s]
[INFO] midPoint Infrastructure - schema ................... SUCCESS [01:45 min]
[INFO] midPoint Repository ................................ SUCCESS [  0.105 s]
[INFO] midPoint Repository - api .......................... SUCCESS [  0.759 s]
[INFO] midPoint Task Manager - api ........................ SUCCESS [  1.218 s]
[INFO] midPoint Infrastructure - testing utils (lvl 2) .... SUCCESS [  5.790 s]
[INFO] midPoint Infrastructure - common ................... SUCCESS [  1.572 s]
[INFO] midPoint Audit - api ............................... SUCCESS [  0.512 s]
[INFO] midPoint Security - api ............................ SUCCESS [  0.996 s]
[INFO] midPoint Repository - SQL common support ........... SUCCESS [  1.466 s]
[INFO] midPoint Repository - sql repository ............... SUCCESS [  6.778 s]
[INFO] midPoint System Initialization ..................... SUCCESS [ 23.586 s]
[INFO] midPoint Repository - new SQL repository ........... SUCCESS [  6.850 s]
[INFO] midPoint Repository - sql repository test .......... SUCCESS [  3.363 s]
[INFO] midPoint Repository Cache .......................... SUCCESS [  1.604 s]
[INFO] midPoint Audit - logging impl ...................... SUCCESS [  0.338 s]
[INFO] midPoint Icf Connectors ............................ SUCCESS [  0.110 s]
[INFO] Dummy Resource ..................................... SUCCESS [  0.396 s]
[INFO] midPoint Repository - test utils ................... SUCCESS [  3.358 s]
[INFO] midPoint Security - impl ........................... SUCCESS [  0.897 s]
[INFO] midPoint Task Manager - Quartz impl ................ SUCCESS [  2.371 s]
[INFO] midPoint Tools ..................................... SUCCESS [  0.091 s]
[INFO] midPoint Tools - Ninja ............................. SUCCESS [  4.574 s]
[INFO] midPoint Tools - custom Spring Boot JAR layout ..... SUCCESS [  0.300 s]
[INFO] midPoint Infrastructure - pure JAXB schema ......... SUCCESS [ 11.908 s]
[INFO] midPoint Repo Commons .............................. SUCCESS [  3.606 s]
[INFO] midPoint Security Enforcer - api ................... SUCCESS [  0.413 s]
[INFO] midPoint Security Enforcer - impl .................. SUCCESS [  0.887 s]
[INFO] midPoint Provisioning .............................. SUCCESS [  0.093 s]
[INFO] midPoint Provisioning - api ........................ SUCCESS [  0.476 s]
[INFO] Unified Connector Framework - api .................. SUCCESS [  0.562 s]
[INFO] Dummy Connector .................................... SUCCESS [  0.752 s]
[INFO] Unified Connector Framework - ConnId impl .......... SUCCESS [  2.446 s]
[INFO] Unified Connector Framework - Built-in impl ........ SUCCESS [  2.079 s]
[INFO] midPoint Provisioning - impl ....................... SUCCESS [  5.625 s]
[INFO] midPoint Model ..................................... SUCCESS [  0.086 s]
[INFO] midPoint Model - api ............................... SUCCESS [  1.245 s]
[INFO] midPoint Model - common ............................ SUCCESS [  4.625 s]
[INFO] midPoint Notifications - api ....................... SUCCESS [  0.409 s]
[INFO] Dummy Connector Fake ............................... SUCCESS [  0.234 s]
[INFO] midPoint Authentication - api ...................... SUCCESS [  0.845 s]
[INFO] midPoint Model - test .............................. SUCCESS [  1.951 s]
[INFO] midPoint Report - api .............................. SUCCESS [  0.380 s]
[INFO] midPoint Cases - api ............................... SUCCESS [  0.497 s]
[INFO] midPoint Access Certification - api ................ SUCCESS [  0.329 s]
[INFO] midPoint Model - impl .............................. SUCCESS [ 13.773 s]
[INFO] midPoint Notifications - impl ...................... SUCCESS [  3.053 s]
[INFO] midPoint Report - impl ............................. SUCCESS [  2.250 s]
[INFO] midPoint Model - integration tests ................. SUCCESS [  6.921 s]
[INFO] midPoint Workflow - api ............................ SUCCESS [  0.352 s]
[INFO] midPoint Cases - impl .............................. SUCCESS [  0.843 s]
[INFO] midPoint Workflow - impl ........................... SUCCESS [  3.018 s]
[INFO] midPoint Access Certification - impl ............... SUCCESS [  2.082 s]
[INFO] midPoint Authentication - impl ..................... SUCCESS [  7.976 s]
[INFO] midPoint REST-ish service implementation ........... SUCCESS [  0.784 s]
[INFO] midPoint Customizations ............................ SUCCESS [  0.109 s]
[INFO] midPoint User Interface ............................ SUCCESS [  0.090 s]
[INFO] midPoint User Interface - admin web gui ............ FAILURE [01:47 min]
[INFO] midPoint Testing Infrastructure .................... SKIPPED
[INFO] midPoint Testing - Resource Connection Tests ....... SKIPPED
[INFO] midPoint Testing - Long Tests ...................... SKIPPED
[INFO] midPoint Testing - Story Tests ..................... SKIPPED
[INFO] midPoint Testing - REST API ........................ SKIPPED
[INFO] ------------------------------------------------------------------------
[INFO] BUILD FAILURE
[INFO] ------------------------------------------------------------------------
[INFO] Total time:  06:20 min
[INFO] Finished at: 2024-05-04T19:35:57Z
[INFO] ------------------------------------------------------------------------
[ERROR] Failed to execute goal org.apache.maven.plugins:maven-compiler-plugin:3.11.0:compile (default-compile) on project admin-gui: Compilation failure: Compilation failure: 
[ERROR] /home/jenkins/agent/workspace/midpoint-support-4-8-generic-oracle-jdk21/gui/admin-gui/src/main/java/com/evolveum/midpoint/gui/impl/component/search/panel/SingleSearchItemPanel.java:[97,39] cannot find symbol
[ERROR]   symbol:   class VisibleEnableBehaviour
[ERROR]   location: class com.evolveum.midpoint.gui.impl.component.search.panel.SingleSearchItemPanel<S>
[ERROR] /home/jenkins/agent/workspace/midpoint-support-4-8-generic-oracle-jdk21/gui/admin-gui/src/main/java/com/evolveum/midpoint/gui/impl/component/search/panel/SingleSearchItemPanel.java:[101,17] method does not override or implement a method from a supertype
[ERROR] -> [Help 1]
[ERROR] 
[ERROR] To see the full stack trace of the errors, re-run Maven with the -e switch.
[ERROR] Re-run Maven using the -X switch to enable full debug logging.
[ERROR] 
[ERROR] For more information about the errors and possible solutions, please read the following articles:
[ERROR] [Help 1] http://cwiki.apache.org/confluence/display/MAVEN/MojoFailureException
[ERROR] 
[ERROR] After correcting the problems, you can resume the build with the command
[ERROR]   mvn <args> -rf :admin-gui
[Pipeline] }
[Pipeline] // container
[Pipeline] }
[Pipeline] // stage
[Pipeline] error
[Pipeline] container
[Pipeline] {
[Pipeline] withKubeConfig
[Pipeline] {
[Pipeline] sh
pod "test-db-midpoint-support-4-8-generic-oracle-jdk21-102" deleted
persistentvolumeclaim "test-db-midpoint-support-4-8-generic-oracle-jdk21-102" deleted
[Pipeline] }
[kubernetes-cli] kubectl configuration cleaned up
[Pipeline] // withKubeConfig
[Pipeline] }
[Pipeline] // container
[Pipeline] step


More information about the midPoint-ci mailing list