[midPoint-ci] Build failed in Jenkins: midPoint - master - compile #3574
Jenkins
noreply at evolveum.com
Mon Aug 19 10:49:44 CEST 2024
See <https://jenkins.evolveum.com/job/midpoint-master-compile/3574/display/redirect>
Changes:
------------------------------------------
[...truncated 3652 lines...]
[INFO] Building jar: /home/jenkins/agent/workspace/midpoint-master-compile/model/workflow-api/target/workflow-api-4.9-SNAPSHOT.jar
[INFO]
[INFO] >>> source:3.1.0:jar (attach-sources) > generate-sources @ workflow-api >>>
[INFO]
[INFO] --- enforcer:3.4.1:enforce (enforce) @ workflow-api ---
[INFO] Rule 1: org.apache.maven.enforcer.rules.dependency.DependencyConvergence passed
[INFO] Rule 2: org.apache.maven.enforcer.rules.dependency.BannedDependencies passed
[INFO]
[INFO] --- checkstyle:3.1.2:check (validate) @ workflow-api ---
[INFO] Starting audit...
Audit done.
[INFO] You have 0 Checkstyle violations.
[INFO]
[INFO] --- gitdescribe:3.0:gitdescribe (git-describe) @ workflow-api ---
[INFO]
[INFO] <<< source:3.1.0:jar (attach-sources) < generate-sources @ workflow-api <<<
[INFO]
[INFO]
[INFO] --- source:3.1.0:jar (attach-sources) @ workflow-api ---
[INFO] Building jar: /home/jenkins/agent/workspace/midpoint-master-compile/model/workflow-api/target/workflow-api-4.9-SNAPSHOT-sources.jar
[INFO]
[INFO] ---------------< com.evolveum.midpoint.model:cases-impl >---------------
[INFO] Building midPoint Cases - impl 4.9-SNAPSHOT [52/64]
[INFO] from model/cases-impl/pom.xml
[INFO] --------------------------------[ jar ]---------------------------------
[INFO]
[INFO] --- clean:3.3.2:clean (default-clean) @ cases-impl ---
[INFO]
[INFO] --- enforcer:3.4.1:enforce (enforce) @ cases-impl ---
[INFO] Rule 1: org.apache.maven.enforcer.rules.dependency.DependencyConvergence passed
[INFO] Rule 2: org.apache.maven.enforcer.rules.dependency.BannedDependencies passed
[INFO]
[INFO] --- checkstyle:3.1.2:check (validate) @ cases-impl ---
[INFO] Starting audit...
Audit done.
[INFO] You have 0 Checkstyle violations.
[INFO]
[INFO] --- gitdescribe:3.0:gitdescribe (git-describe) @ cases-impl ---
[INFO] Setting Git Describe: v4.9devel-2480-gcc7b8ec0569
[INFO]
[INFO] --- resources:3.1.0:resources (default-resources) @ cases-impl ---
[INFO] Using 'UTF-8' encoding to copy filtered resources.
[INFO] Copying 1 resource
[INFO]
[INFO] --- compiler:3.11.0:compile (default-compile) @ cases-impl ---
[INFO] Changes detected - recompiling the module! :dependency
[INFO] Compiling 40 source files with javac [debug target 17] to target/classes
[WARNING] system modules path not set in conjunction with -source 17
[INFO] /home/jenkins/agent/workspace/midpoint-master-compile/model/cases-impl/src/main/java/com/evolveum/midpoint/cases/impl/helpers/CaseExpressionEvaluationHelper.java: Some input files use or override a deprecated API.
[INFO] /home/jenkins/agent/workspace/midpoint-master-compile/model/cases-impl/src/main/java/com/evolveum/midpoint/cases/impl/helpers/CaseExpressionEvaluationHelper.java: Recompile with -Xlint:deprecation for details.
[INFO] /home/jenkins/agent/workspace/midpoint-master-compile/model/cases-impl/src/main/java/com/evolveum/midpoint/cases/impl/engine/CaseEngineOperationImpl.java: Some input files use unchecked or unsafe operations.
[INFO] /home/jenkins/agent/workspace/midpoint-master-compile/model/cases-impl/src/main/java/com/evolveum/midpoint/cases/impl/engine/CaseEngineOperationImpl.java: Recompile with -Xlint:unchecked for details.
[INFO]
[INFO] --- resources:3.1.0:testResources (default-testResources) @ cases-impl ---
[INFO] Not copying test resources
[INFO]
[INFO] --- compiler:3.11.0:testCompile (default-testCompile) @ cases-impl ---
[INFO] Not compiling test sources
[INFO]
[INFO] --- surefire:3.1.2:test (default-test) @ cases-impl ---
[INFO] Tests are skipped.
[INFO]
[INFO] --- jar:3.4.2:jar (default-jar) @ cases-impl ---
[INFO] Building jar: /home/jenkins/agent/workspace/midpoint-master-compile/model/cases-impl/target/cases-impl-4.9-SNAPSHOT.jar
[INFO]
[INFO] >>> source:3.1.0:jar (attach-sources) > generate-sources @ cases-impl >>>
[INFO]
[INFO] --- enforcer:3.4.1:enforce (enforce) @ cases-impl ---
[INFO] Rule 1: org.apache.maven.enforcer.rules.dependency.DependencyConvergence passed
[INFO] Rule 2: org.apache.maven.enforcer.rules.dependency.BannedDependencies passed
[INFO]
[INFO] --- checkstyle:3.1.2:check (validate) @ cases-impl ---
[INFO] Starting audit...
Audit done.
[INFO] You have 0 Checkstyle violations.
[INFO]
[INFO] --- gitdescribe:3.0:gitdescribe (git-describe) @ cases-impl ---
[INFO]
[INFO] <<< source:3.1.0:jar (attach-sources) < generate-sources @ cases-impl <<<
[INFO]
[INFO]
[INFO] --- source:3.1.0:jar (attach-sources) @ cases-impl ---
[INFO] Building jar: /home/jenkins/agent/workspace/midpoint-master-compile/model/cases-impl/target/cases-impl-4.9-SNAPSHOT-sources.jar
[INFO]
[INFO] -------------< com.evolveum.midpoint.model:workflow-impl >--------------
[INFO] Building midPoint Workflow - impl 4.9-SNAPSHOT [53/64]
[INFO] from model/workflow-impl/pom.xml
[INFO] --------------------------------[ jar ]---------------------------------
[INFO]
[INFO] --- clean:3.3.2:clean (default-clean) @ workflow-impl ---
[INFO]
[INFO] --- enforcer:3.4.1:enforce (enforce) @ workflow-impl ---
[INFO] Rule 1: org.apache.maven.enforcer.rules.dependency.DependencyConvergence passed
[INFO] Rule 2: org.apache.maven.enforcer.rules.dependency.BannedDependencies passed
[INFO]
[INFO] --- checkstyle:3.1.2:check (validate) @ workflow-impl ---
[INFO] Starting audit...
Audit done.
[INFO] You have 0 Checkstyle violations.
[INFO]
[INFO] --- gitdescribe:3.0:gitdescribe (git-describe) @ workflow-impl ---
[INFO] Setting Git Describe: v4.9devel-2480-gcc7b8ec0569
[INFO]
[INFO] --- resources:3.1.0:resources (default-resources) @ workflow-impl ---
[INFO] Using 'UTF-8' encoding to copy filtered resources.
[INFO] Copying 1 resource
[INFO]
[INFO] --- compiler:3.11.0:compile (default-compile) @ workflow-impl ---
[INFO] Changes detected - recompiling the module! :dependency
[INFO] Compiling 45 source files with javac [debug target 17] to target/classes
[WARNING] system modules path not set in conjunction with -source 17
[INFO] /home/jenkins/agent/workspace/midpoint-master-compile/model/workflow-impl/src/main/java/com/evolveum/midpoint/wf/impl/processors/primary/aspect/PrimaryChangeAspectHelper.java: Some input files use or override a deprecated API.
[INFO] /home/jenkins/agent/workspace/midpoint-master-compile/model/workflow-impl/src/main/java/com/evolveum/midpoint/wf/impl/processors/primary/aspect/PrimaryChangeAspectHelper.java: Recompile with -Xlint:deprecation for details.
[INFO] /home/jenkins/agent/workspace/midpoint-master-compile/model/workflow-impl/src/main/java/com/evolveum/midpoint/wf/impl/util/MiscHelper.java: Some input files use unchecked or unsafe operations.
[INFO] /home/jenkins/agent/workspace/midpoint-master-compile/model/workflow-impl/src/main/java/com/evolveum/midpoint/wf/impl/util/MiscHelper.java: Recompile with -Xlint:unchecked for details.
[INFO]
[INFO] --- resources:3.1.0:testResources (default-testResources) @ workflow-impl ---
[INFO] Using 'UTF-8' encoding to copy filtered resources.
[INFO] Copying 162 resources
[INFO]
[INFO] --- compiler:3.11.0:testCompile (default-testCompile) @ workflow-impl ---
[INFO] Changes detected - recompiling the module! :dependency
[INFO] Compiling 28 source files with javac [debug target 17] to target/test-classes
[WARNING] system modules path not set in conjunction with -source 17
[INFO] /home/jenkins/agent/workspace/midpoint-master-compile/model/workflow-impl/src/test/java/com/evolveum/midpoint/wf/impl/objects/AbstractTestObjectLifecycleApproval.java: Some input files use or override a deprecated API.
[INFO] /home/jenkins/agent/workspace/midpoint-master-compile/model/workflow-impl/src/test/java/com/evolveum/midpoint/wf/impl/objects/AbstractTestObjectLifecycleApproval.java: Recompile with -Xlint:deprecation for details.
[INFO] /home/jenkins/agent/workspace/midpoint-master-compile/model/workflow-impl/src/test/java/com/evolveum/midpoint/wf/impl/AbstractWfTest.java: Some input files use unchecked or unsafe operations.
[INFO] /home/jenkins/agent/workspace/midpoint-master-compile/model/workflow-impl/src/test/java/com/evolveum/midpoint/wf/impl/AbstractWfTest.java: Recompile with -Xlint:unchecked for details.
[INFO]
[INFO] --- surefire:3.1.2:test (default-test) @ workflow-impl ---
[INFO] Tests are skipped.
[INFO]
[INFO] --- jar:3.4.2:jar (default-jar) @ workflow-impl ---
[INFO] Building jar: /home/jenkins/agent/workspace/midpoint-master-compile/model/workflow-impl/target/workflow-impl-4.9-SNAPSHOT.jar
[INFO]
[INFO] >>> source:3.1.0:jar (attach-sources) > generate-sources @ workflow-impl >>>
[INFO]
[INFO] --- enforcer:3.4.1:enforce (enforce) @ workflow-impl ---
[INFO] Rule 1: org.apache.maven.enforcer.rules.dependency.DependencyConvergence passed
[INFO] Rule 2: org.apache.maven.enforcer.rules.dependency.BannedDependencies passed
[INFO]
[INFO] --- checkstyle:3.1.2:check (validate) @ workflow-impl ---
[INFO] Starting audit...
Audit done.
[INFO] You have 0 Checkstyle violations.
[INFO]
[INFO] --- gitdescribe:3.0:gitdescribe (git-describe) @ workflow-impl ---
[INFO]
[INFO] <<< source:3.1.0:jar (attach-sources) < generate-sources @ workflow-impl <<<
[INFO]
[INFO]
[INFO] --- source:3.1.0:jar (attach-sources) @ workflow-impl ---
[INFO] Building jar: /home/jenkins/agent/workspace/midpoint-master-compile/model/workflow-impl/target/workflow-impl-4.9-SNAPSHOT-sources.jar
[270.256s][warning][gc,alloc] pool-165-thread-3: Retried waiting for GCLocker too often allocating 312502 words
[270.259s][warning][gc,alloc] pool-165-thread-3: Retried waiting for GCLocker too often allocating 312502 words
[270.262s][warning][gc,alloc] pool-165-thread-3: Retried waiting for GCLocker too often allocating 312502 words
[270.266s][warning][gc,alloc] pool-165-thread-3: Retried waiting for GCLocker too often allocating 312502 words
[270.269s][warning][gc,alloc] pool-165-thread-3: Retried waiting for GCLocker too often allocating 312502 words
[270.273s][warning][gc,alloc] pool-165-thread-3: Retried waiting for GCLocker too often allocating 312502 words
[270.276s][warning][gc,alloc] pool-165-thread-3: Retried waiting for GCLocker too often allocating 312502 words
[INFO] ------------------------------------------------------------------------
[INFO] Reactor Summary for midPoint Project 4.9-SNAPSHOT:
[INFO]
[INFO] midPoint Project ................................... SUCCESS [ 12.184 s]
[INFO] midPoint Infrastructure ............................ SUCCESS [ 0.213 s]
[INFO] midPoint Infrastructure - schema ................... SUCCESS [01:51 min]
[INFO] midPoint Repository ................................ SUCCESS [ 0.192 s]
[INFO] midPoint Repository - api .......................... SUCCESS [ 0.589 s]
[INFO] midPoint Task Manager - api ........................ SUCCESS [ 0.968 s]
[INFO] midPoint Infrastructure - testing utils (lvl 2) .... SUCCESS [ 4.322 s]
[INFO] midPoint Infrastructure - common ................... SUCCESS [ 1.984 s]
[INFO] midPoint Audit - api ............................... SUCCESS [ 0.446 s]
[INFO] midPoint Security - api ............................ SUCCESS [ 0.814 s]
[INFO] midPoint Repository - SQL common support ........... SUCCESS [ 1.141 s]
[INFO] midPoint Repository - sql repository ............... SUCCESS [ 6.368 s]
[INFO] midPoint System Initialization ..................... SUCCESS [ 25.070 s]
[INFO] midPoint Repository - new SQL repository ........... SUCCESS [ 7.784 s]
[INFO] midPoint Repository - sql repository test .......... SUCCESS [ 3.446 s]
[INFO] midPoint Repository Cache .......................... SUCCESS [ 1.392 s]
[INFO] midPoint Audit - logging impl ...................... SUCCESS [ 0.336 s]
[INFO] midPoint Icf Connectors ............................ SUCCESS [ 0.150 s]
[INFO] Dummy Resource ..................................... SUCCESS [ 0.813 s]
[INFO] midPoint Repository - test utils ................... SUCCESS [ 3.649 s]
[INFO] midPoint Security - impl ........................... SUCCESS [ 0.803 s]
[INFO] midPoint Task Manager - Quartz impl ................ SUCCESS [ 2.386 s]
[INFO] midPoint Tools ..................................... SUCCESS [ 0.175 s]
[INFO] midPoint Tools - Ninja ............................. SUCCESS [ 4.831 s]
[INFO] midPoint Tools - custom Spring Boot JAR layout ..... SUCCESS [ 0.294 s]
[INFO] midPoint Infrastructure - pure JAXB schema ......... SUCCESS [ 14.749 s]
[INFO] midPoint Repo Commons .............................. SUCCESS [ 3.641 s]
[INFO] midPoint Security Enforcer - api ................... SUCCESS [ 0.389 s]
[INFO] midPoint Security Enforcer - impl .................. SUCCESS [ 0.842 s]
[INFO] midPoint Provisioning .............................. SUCCESS [ 0.157 s]
[INFO] midPoint Provisioning - api ........................ SUCCESS [ 0.467 s]
[INFO] Unified Connector Framework - api .................. SUCCESS [ 0.600 s]
[INFO] Dummy Connector .................................... SUCCESS [ 0.756 s]
[INFO] Unified Connector Framework - ConnId impl .......... SUCCESS [ 2.457 s]
[INFO] Unified Connector Framework - Built-in impl ........ SUCCESS [ 2.236 s]
[INFO] midPoint Provisioning - impl ....................... SUCCESS [ 6.019 s]
[INFO] midPoint Model ..................................... SUCCESS [ 0.148 s]
[INFO] midPoint Model - api ............................... SUCCESS [ 1.372 s]
[INFO] midPoint Model - common ............................ SUCCESS [ 4.353 s]
[INFO] midPoint Notifications - api ....................... SUCCESS [ 0.520 s]
[INFO] Dummy Connector Fake ............................... SUCCESS [ 0.233 s]
[INFO] midPoint Authentication - api ...................... SUCCESS [ 0.873 s]
[INFO] midPoint Model - test .............................. SUCCESS [ 2.056 s]
[INFO] midPoint Report - api .............................. SUCCESS [ 0.334 s]
[INFO] midPoint Cases - api ............................... SUCCESS [ 0.426 s]
[INFO] midPoint Access Certification - api ................ SUCCESS [ 0.330 s]
[INFO] midPoint Model - impl .............................. SUCCESS [ 14.906 s]
[INFO] midPoint Notifications - impl ...................... SUCCESS [ 2.610 s]
[INFO] midPoint Report - impl ............................. SUCCESS [ 2.097 s]
[INFO] midPoint Model - integration tests ................. SUCCESS [ 7.746 s]
[INFO] midPoint Workflow - api ............................ SUCCESS [ 0.359 s]
[INFO] midPoint Cases - impl .............................. SUCCESS [ 0.985 s]
[INFO] midPoint Workflow - impl ........................... FAILURE [ 2.868 s]
[INFO] midPoint Access Certification - impl ............... SKIPPED
[INFO] midPoint Authentication - impl ..................... SKIPPED
[INFO] midPoint REST-ish service implementation ........... SKIPPED
[INFO] midPoint Customizations ............................ SKIPPED
[INFO] midPoint User Interface ............................ SKIPPED
[INFO] midPoint User Interface - admin web gui ............ SKIPPED
[INFO] midPoint Testing Infrastructure .................... SKIPPED
[INFO] midPoint Testing - Resource Connection Tests ....... SKIPPED
[INFO] midPoint Testing - Long Tests ...................... SKIPPED
[INFO] midPoint Testing - Story Tests ..................... SKIPPED
[INFO] midPoint Testing - REST API ........................ SKIPPED
[INFO] ------------------------------------------------------------------------
[INFO] BUILD FAILURE
[INFO] ------------------------------------------------------------------------
[INFO] Total time: 04:29 min
[INFO] Finished at: 2024-08-19T08:49:43Z
[INFO] ------------------------------------------------------------------------
[ERROR] Failed to execute goal org.apache.maven.plugins:maven-source-plugin:3.1.0:jar (attach-sources) on project workflow-impl: Error creating source archive: Problem creating jar: Execution exception: Java heap space -> [Help 1]
[ERROR]
[ERROR] To see the full stack trace of the errors, re-run Maven with the -e switch.
[ERROR] Re-run Maven using the -X switch to enable full debug logging.
[ERROR]
[ERROR] For more information about the errors and possible solutions, please read the following articles:
[ERROR] [Help 1] http://cwiki.apache.org/confluence/display/MAVEN/MojoExecutionException
[ERROR]
[ERROR] After correcting the problems, you can resume the build with the command
[ERROR] mvn <args> -rf :workflow-impl
[Pipeline] }
[Pipeline] // container
[Pipeline] }
[Pipeline] // stage
[Pipeline] error
[Pipeline] step
More information about the midPoint-ci
mailing list