[midPoint-ci] Build failed in Jenkins: midPoint - support 4.7 - main build #31
Jenkins
noreply at evolveum.com
Thu Jul 27 12:25:11 CEST 2023
See <https://jenkins.evolveum.com/job/midpoint-support-4-7-main/31/display/redirect>
Changes:
------------------------------------------
[...truncated 15349 lines...]
[WARNING] /home/jenkins/agent/workspace/midpoint-support-4-7-main/dist/javadoc/target/distro-javadoc-sources/prism-api-4.7.2-20230721.133022-3-sources/com/evolveum/midpoint/prism/path/ItemPath.java:78: warning - invalid usage of tag >
[WARNING] /home/jenkins/agent/workspace/midpoint-support-4-7-main/dist/javadoc/target/distro-javadoc-sources/prism-api-4.7.2-20230721.133022-3-sources/com/evolveum/midpoint/prism/path/ItemPath.java:99: warning - invalid usage of tag >
[WARNING] /home/jenkins/agent/workspace/midpoint-support-4-7-main/dist/javadoc/target/distro-javadoc-sources/prism-api-4.7.2-20230721.133022-3-sources/com/evolveum/midpoint/prism/path/ItemPath.java:74: warning - invalid usage of tag >
[WARNING] /home/jenkins/agent/workspace/midpoint-support-4-7-main/dist/javadoc/target/distro-javadoc-sources/prism-api-4.7.2-20230721.133022-3-sources/com/evolveum/midpoint/prism/path/ItemPath.java:75: warning - invalid usage of tag >
[WARNING] /home/jenkins/agent/workspace/midpoint-support-4-7-main/dist/javadoc/target/distro-javadoc-sources/prism-api-4.7.2-20230721.133022-3-sources/com/evolveum/midpoint/prism/path/ItemPath.java:76: warning - invalid usage of tag >
[WARNING] /home/jenkins/agent/workspace/midpoint-support-4-7-main/dist/javadoc/target/distro-javadoc-sources/prism-api-4.7.2-20230721.133022-3-sources/com/evolveum/midpoint/prism/path/ItemPath.java:77: warning - invalid usage of tag >
[WARNING] /home/jenkins/agent/workspace/midpoint-support-4-7-main/dist/javadoc/target/distro-javadoc-sources/prism-api-4.7.2-20230721.133022-3-sources/com/evolveum/midpoint/prism/path/ItemPath.java:78: warning - invalid usage of tag >
[WARNING] /home/jenkins/agent/workspace/midpoint-support-4-7-main/dist/javadoc/target/distro-javadoc-sources/prism-api-4.7.2-20230721.133022-3-sources/com/evolveum/midpoint/prism/query/ValueFilter.java:128: warning - @param argument "potential" is not a parameter name.
[WARNING] /home/jenkins/agent/workspace/midpoint-support-4-7-main/provisioning/provisioning-api/src/main/java/com/evolveum/midpoint/provisioning/api/LiveSyncEventHandler.java:16: warning - Tag @link: reference not found: ProvisioningService#synchronize(ResourceShadowCoordinates, LiveSyncOptions,
[WARNING] LiveSyncTokenStorage, LiveSyncEventHandler, Task, OperationResult)
[WARNING] /home/jenkins/agent/workspace/midpoint-support-4-7-main/provisioning/provisioning-api/src/main/java/com/evolveum/midpoint/provisioning/api/SynchronizationEvent.java:41: warning - Tag @link: reference not found: ProvisioningService#synchronize(com.evolveum.midpoint.schema.ResourceShadowCoordinates, LiveSyncOptions,
[WARNING] LiveSyncTokenStorage, LiveSyncEventHandler, Task, OperationResult)
[WARNING] /home/jenkins/agent/workspace/midpoint-support-4-7-main/provisioning/provisioning-api/src/main/java/com/evolveum/midpoint/provisioning/api/SynchronizationEvent.java:43: warning - Tag @link: reference not found: ProvisioningService#processAsynchronousUpdates(com.evolveum.midpoint.schema.ResourceShadowCoordinates,
[WARNING] AsyncUpdateEventHandler, Task, OperationResult)
[WARNING] /home/jenkins/agent/workspace/midpoint-support-4-7-main/repo/repo-api/src/main/java/com/evolveum/midpoint/repo/api/RepositoryService.java:555: warning - invalid usage of tag <
[WARNING] /home/jenkins/agent/workspace/midpoint-support-4-7-main/repo/repo-common/src/main/java/com/evolveum/midpoint/repo/common/activity/run/state/ActivityState.java:365: warning - invalid usage of tag >
[WARNING] /home/jenkins/agent/workspace/midpoint-support-4-7-main/repo/repo-sqale/src/main/java/com/evolveum/midpoint/repo/sqale/filtering/ExtensionItemFilterProcessor.java:62: warning - invalid usage of tag >
[WARNING] /home/jenkins/agent/workspace/midpoint-support-4-7-main/repo/repo-sqale/src/main/java/com/evolveum/midpoint/repo/sqale/filtering/ExtensionItemFilterProcessor.java:62: warning - invalid usage of tag >
[WARNING] /home/jenkins/agent/workspace/midpoint-support-4-7-main/repo/repo-sqale/src/main/java/com/evolveum/midpoint/repo/sqale/filtering/ExtensionItemFilterProcessor.java:62: warning - invalid usage of tag <
[WARNING] /home/jenkins/agent/workspace/midpoint-support-4-7-main/repo/repo-sqale/src/main/java/com/evolveum/midpoint/repo/sqale/filtering/ExtensionItemFilterProcessor.java:62: warning - invalid usage of tag >
[WARNING] /home/jenkins/agent/workspace/midpoint-support-4-7-main/repo/repo-sqale/src/main/java/com/evolveum/midpoint/repo/sqale/filtering/ExtensionItemFilterProcessor.java:62: warning - invalid usage of tag >
[WARNING] /home/jenkins/agent/workspace/midpoint-support-4-7-main/repo/repo-sqale/src/main/java/com/evolveum/midpoint/repo/sqale/mapping/RefTableTargetResolver.java:26: warning - invalid usage of tag <
[WARNING] /home/jenkins/agent/workspace/midpoint-support-4-7-main/repo/repo-sqale/src/main/java/com/evolveum/midpoint/repo/sqale/mapping/RefTableTargetResolver.java:26: warning - invalid usage of tag >
[WARNING] /home/jenkins/agent/workspace/midpoint-support-4-7-main/repo/repo-sqale/src/main/java/com/evolveum/midpoint/repo/sqale/qmodel/org/QOrgClosure.java:25: warning - Tag @link: reference not found: SqaleRepositoryService#isAnySubordinate(java.lang.String, java.util.Collection)
[WARNING] /home/jenkins/agent/workspace/midpoint-support-4-7-main/repo/repo-sqlbase/src/main/java/com/evolveum/midpoint/repo/sqlbase/mapping/SqlDetailFetchMapper.java:32: warning - Tag @link: reference not found: #execute(SqlRepoContext, Supplier, R)
[WARNING] /home/jenkins/agent/workspace/midpoint-support-4-7-main/infra/schema/src/main/java/com/evolveum/midpoint/schema/DeltaConvertor.java:346: warning - invalid usage of tag >
[WARNING] /home/jenkins/agent/workspace/midpoint-support-4-7-main/infra/schema/src/main/java/com/evolveum/midpoint/schema/DeltaConvertor.java:332: warning - invalid usage of tag >
[WARNING] /home/jenkins/agent/workspace/midpoint-support-4-7-main/infra/schema/src/main/java/com/evolveum/midpoint/schema/DeltaConvertor.java:98: warning - invalid usage of tag >
[WARNING] /home/jenkins/agent/workspace/midpoint-support-4-7-main/infra/schema/src/main/java/com/evolveum/midpoint/schema/DeltaConvertor.java:81: warning - invalid usage of tag >
[WARNING] /home/jenkins/agent/workspace/midpoint-support-4-7-main/infra/schema/src/main/java/com/evolveum/midpoint/schema/DeltaConvertor.java:64: warning - invalid usage of tag >
[WARNING] /home/jenkins/agent/workspace/midpoint-support-4-7-main/infra/schema/src/main/java/com/evolveum/midpoint/schema/DeltaConvertor.java:49: warning - invalid usage of tag >
[WARNING] /home/jenkins/agent/workspace/midpoint-support-4-7-main/infra/schema/src/main/java/com/evolveum/midpoint/schema/DeltaConvertor.java:134: warning - invalid usage of tag >
[WARNING] /home/jenkins/agent/workspace/midpoint-support-4-7-main/infra/schema/src/main/java/com/evolveum/midpoint/schema/DeltaConvertor.java:452: warning - invalid usage of tag >
[WARNING] /home/jenkins/agent/workspace/midpoint-support-4-7-main/infra/schema/src/main/java/com/evolveum/midpoint/schema/DeltaConvertor.java:257: warning - invalid usage of tag >
[WARNING] /home/jenkins/agent/workspace/midpoint-support-4-7-main/infra/schema/src/main/java/com/evolveum/midpoint/schema/DeltaConvertor.java:358: warning - invalid usage of tag >
[WARNING] /home/jenkins/agent/workspace/midpoint-support-4-7-main/infra/schema/src/main/java/com/evolveum/midpoint/schema/DeltaConvertor.java:365: warning - invalid usage of tag >
[WARNING] /home/jenkins/agent/workspace/midpoint-support-4-7-main/infra/schema/src/main/java/com/evolveum/midpoint/schema/DeltaConvertor.java:168: warning - invalid usage of tag >
[WARNING] /home/jenkins/agent/workspace/midpoint-support-4-7-main/infra/schema/src/main/java/com/evolveum/midpoint/schema/DeltaConvertor.java:154: warning - invalid usage of tag >
[WARNING] /home/jenkins/agent/workspace/midpoint-support-4-7-main/infra/schema/src/main/java/com/evolveum/midpoint/schema/DeltaConvertor.java:176: warning - invalid usage of tag >
[WARNING] /home/jenkins/agent/workspace/midpoint-support-4-7-main/infra/schema/src/main/java/com/evolveum/midpoint/schema/DeltaConvertor.java:282: warning - invalid usage of tag >
[WARNING] /home/jenkins/agent/workspace/midpoint-support-4-7-main/infra/schema/src/main/java/com/evolveum/midpoint/schema/DeltaConvertor.java:290: warning - invalid usage of tag >
[WARNING] /home/jenkins/agent/workspace/midpoint-support-4-7-main/infra/schema/src/main/java/com/evolveum/midpoint/schema/DeltaConvertor.java:300: warning - invalid usage of tag >
[WARNING] /home/jenkins/agent/workspace/midpoint-support-4-7-main/infra/schema/src/main/java/com/evolveum/midpoint/schema/DeltaConvertor.java:210: warning - invalid usage of tag >
[WARNING] /home/jenkins/agent/workspace/midpoint-support-4-7-main/infra/schema/src/main/java/com/evolveum/midpoint/schema/DeltaConvertor.java:218: warning - invalid usage of tag >
[WARNING] /home/jenkins/agent/workspace/midpoint-support-4-7-main/infra/schema/src/main/java/com/evolveum/midpoint/schema/DeltaConvertor.java:188: warning - invalid usage of tag >
[WARNING] /home/jenkins/agent/workspace/midpoint-support-4-7-main/infra/schema/src/main/java/com/evolveum/midpoint/schema/DeltaConvertor.java:49: warning - invalid usage of tag >
[WARNING] /home/jenkins/agent/workspace/midpoint-support-4-7-main/infra/schema/src/main/java/com/evolveum/midpoint/schema/DeltaConvertor.java:64: warning - invalid usage of tag >
[WARNING] /home/jenkins/agent/workspace/midpoint-support-4-7-main/infra/schema/src/main/java/com/evolveum/midpoint/schema/DeltaConvertor.java:81: warning - invalid usage of tag >
[WARNING] /home/jenkins/agent/workspace/midpoint-support-4-7-main/infra/schema/src/main/java/com/evolveum/midpoint/schema/DeltaConvertor.java:98: warning - invalid usage of tag >
[WARNING] /home/jenkins/agent/workspace/midpoint-support-4-7-main/infra/schema/src/main/java/com/evolveum/midpoint/schema/DeltaConvertor.java:134: warning - invalid usage of tag >
[WARNING] /home/jenkins/agent/workspace/midpoint-support-4-7-main/infra/schema/src/main/java/com/evolveum/midpoint/schema/DeltaConvertor.java:154: warning - invalid usage of tag >
[WARNING] /home/jenkins/agent/workspace/midpoint-support-4-7-main/infra/schema/src/main/java/com/evolveum/midpoint/schema/DeltaConvertor.java:168: warning - invalid usage of tag >
[WARNING] /home/jenkins/agent/workspace/midpoint-support-4-7-main/infra/schema/src/main/java/com/evolveum/midpoint/schema/DeltaConvertor.java:176: warning - invalid usage of tag >
[WARNING] /home/jenkins/agent/workspace/midpoint-support-4-7-main/infra/schema/src/main/java/com/evolveum/midpoint/schema/DeltaConvertor.java:188: warning - invalid usage of tag >
[WARNING] /home/jenkins/agent/workspace/midpoint-support-4-7-main/infra/schema/src/main/java/com/evolveum/midpoint/schema/DeltaConvertor.java:210: warning - invalid usage of tag >
[WARNING] /home/jenkins/agent/workspace/midpoint-support-4-7-main/infra/schema/src/main/java/com/evolveum/midpoint/schema/DeltaConvertor.java:218: warning - invalid usage of tag >
[WARNING] /home/jenkins/agent/workspace/midpoint-support-4-7-main/infra/schema/src/main/java/com/evolveum/midpoint/schema/DeltaConvertor.java:257: warning - invalid usage of tag >
[INFO] Building jar: /home/jenkins/agent/workspace/midpoint-support-4-7-main/dist/javadoc/target/javadoc-4.7.2-SNAPSHOT-javadoc.jar
[INFO]
[INFO] --- maven-dependency-plugin:3.1.2:analyze-only (analyze) @ javadoc ---
[INFO] Skipping plugin execution
[INFO]
[INFO] --- maven-install-plugin:2.5.2:install (default-install) @ javadoc ---
[INFO] Skipping artifact installation
[INFO]
[INFO] --- maven-deploy-plugin:2.8.2:deploy (default-deploy) @ javadoc ---
[WARNING] Failed to upload checksum to com/evolveum/midpoint/infra/test-util/4.7.2-SNAPSHOT/test-util-4.7.2-20230727.101243-18-sources.jar.sha1
org.apache.maven.wagon.TransferFailedException: transfer failed for https://nexus.evolveum.com/nexus/content/repositories/snapshots/com/evolveum/midpoint/infra/test-util/4.7.2-SNAPSHOT/test-util-4.7.2-20230727.101243-18-sources.jar.sha1, status: 500 Server Error
at org.apache.maven.wagon.providers.http.wagon.shared.AbstractHttpClientWagon.put (AbstractHttpClientWagon.java:835)
at org.apache.maven.wagon.providers.http.wagon.shared.AbstractHttpClientWagon.put (AbstractHttpClientWagon.java:750)
at org.apache.maven.wagon.providers.http.wagon.shared.AbstractHttpClientWagon.put (AbstractHttpClientWagon.java:722)
at org.apache.maven.wagon.providers.http.wagon.shared.AbstractHttpClientWagon.put (AbstractHttpClientWagon.java:716)
at org.apache.maven.wagon.providers.http.wagon.shared.AbstractHttpClientWagon.putFromStream (AbstractHttpClientWagon.java:710)
at org.eclipse.aether.transport.wagon.WagonTransporter$PutTaskRunner.run (WagonTransporter.java:605)
at org.eclipse.aether.transport.wagon.WagonTransporter.execute (WagonTransporter.java:430)
at org.eclipse.aether.transport.wagon.WagonTransporter.put (WagonTransporter.java:413)
at org.eclipse.aether.connector.basic.BasicRepositoryConnector$PutTaskRunner.uploadChecksum (BasicRepositoryConnector.java:610)
at org.eclipse.aether.connector.basic.BasicRepositoryConnector$PutTaskRunner.uploadChecksums (BasicRepositoryConnector.java:593)
at org.eclipse.aether.connector.basic.BasicRepositoryConnector$PutTaskRunner.runTask (BasicRepositoryConnector.java:557)
at org.eclipse.aether.connector.basic.BasicRepositoryConnector$TaskRunner.run (BasicRepositoryConnector.java:364)
at org.eclipse.aether.connector.basic.BasicRepositoryConnector.put (BasicRepositoryConnector.java:288)
at org.eclipse.aether.internal.impl.DefaultDeployer.deploy (DefaultDeployer.java:295)
at org.eclipse.aether.internal.impl.DefaultDeployer.deploy (DefaultDeployer.java:213)
at org.eclipse.aether.internal.impl.DefaultRepositorySystem.deploy (DefaultRepositorySystem.java:386)
at org.apache.maven.artifact.deployer.DefaultArtifactDeployer.deploy (DefaultArtifactDeployer.java:142)
at org.apache.maven.plugin.deploy.AbstractDeployMojo.deploy (AbstractDeployMojo.java:171)
at org.apache.maven.plugin.deploy.DeployMojo.deployProject (DeployMojo.java:279)
at org.apache.maven.plugin.deploy.DeployMojo.execute (DeployMojo.java:185)
at org.apache.maven.plugin.DefaultBuildPluginManager.executeMojo (DefaultBuildPluginManager.java:137)
at org.apache.maven.lifecycle.internal.MojoExecutor.doExecute (MojoExecutor.java:301)
at org.apache.maven.lifecycle.internal.MojoExecutor.execute (MojoExecutor.java:211)
at org.apache.maven.lifecycle.internal.MojoExecutor.execute (MojoExecutor.java:165)
at org.apache.maven.lifecycle.internal.MojoExecutor.execute (MojoExecutor.java:157)
at org.apache.maven.lifecycle.internal.LifecycleModuleBuilder.buildProject (LifecycleModuleBuilder.java:121)
at org.apache.maven.lifecycle.internal.LifecycleModuleBuilder.buildProject (LifecycleModuleBuilder.java:81)
at org.apache.maven.lifecycle.internal.builder.singlethreaded.SingleThreadedBuilder.build (SingleThreadedBuilder.java:56)
at org.apache.maven.lifecycle.internal.LifecycleStarter.execute (LifecycleStarter.java:127)
at org.apache.maven.DefaultMaven.doExecute (DefaultMaven.java:294)
at org.apache.maven.DefaultMaven.doExecute (DefaultMaven.java:192)
at org.apache.maven.DefaultMaven.execute (DefaultMaven.java:105)
at org.apache.maven.cli.MavenCli.execute (MavenCli.java:960)
at org.apache.maven.cli.MavenCli.doMain (MavenCli.java:293)
at org.apache.maven.cli.MavenCli.main (MavenCli.java:196)
at jdk.internal.reflect.NativeMethodAccessorImpl.invoke0 (Native Method)
at jdk.internal.reflect.NativeMethodAccessorImpl.invoke (NativeMethodAccessorImpl.java:62)
at jdk.internal.reflect.DelegatingMethodAccessorImpl.invoke (DelegatingMethodAccessorImpl.java:43)
at java.lang.reflect.Method.invoke (Method.java:566)
at org.codehaus.plexus.classworlds.launcher.Launcher.launchEnhanced (Launcher.java:282)
at org.codehaus.plexus.classworlds.launcher.Launcher.launch (Launcher.java:225)
at org.codehaus.plexus.classworlds.launcher.Launcher.mainWithExitCode (Launcher.java:406)
at org.codehaus.plexus.classworlds.launcher.Launcher.main (Launcher.java:347)
[WARNING] Failed to upload checksum to com/evolveum/midpoint/infra/test-util/4.7.2-SNAPSHOT/test-util-4.7.2-20230727.101243-18-sources.jar.md5
org.apache.maven.wagon.TransferFailedException: transfer failed for https://nexus.evolveum.com/nexus/content/repositories/snapshots/com/evolveum/midpoint/infra/test-util/4.7.2-SNAPSHOT/test-util-4.7.2-20230727.101243-18-sources.jar.md5, status: 500 Server Error
at org.apache.maven.wagon.providers.http.wagon.shared.AbstractHttpClientWagon.put (AbstractHttpClientWagon.java:835)
at org.apache.maven.wagon.providers.http.wagon.shared.AbstractHttpClientWagon.put (AbstractHttpClientWagon.java:750)
at org.apache.maven.wagon.providers.http.wagon.shared.AbstractHttpClientWagon.put (AbstractHttpClientWagon.java:722)
at org.apache.maven.wagon.providers.http.wagon.shared.AbstractHttpClientWagon.put (AbstractHttpClientWagon.java:716)
at org.apache.maven.wagon.providers.http.wagon.shared.AbstractHttpClientWagon.putFromStream (AbstractHttpClientWagon.java:710)
at org.eclipse.aether.transport.wagon.WagonTransporter$PutTaskRunner.run (WagonTransporter.java:605)
at org.eclipse.aether.transport.wagon.WagonTransporter.execute (WagonTransporter.java:430)
at org.eclipse.aether.transport.wagon.WagonTransporter.put (WagonTransporter.java:413)
at org.eclipse.aether.connector.basic.BasicRepositoryConnector$PutTaskRunner.uploadChecksum (BasicRepositoryConnector.java:610)
at org.eclipse.aether.connector.basic.BasicRepositoryConnector$PutTaskRunner.uploadChecksums (BasicRepositoryConnector.java:593)
at org.eclipse.aether.connector.basic.BasicRepositoryConnector$PutTaskRunner.runTask (BasicRepositoryConnector.java:557)
at org.eclipse.aether.connector.basic.BasicRepositoryConnector$TaskRunner.run (BasicRepositoryConnector.java:364)
at org.eclipse.aether.connector.basic.BasicRepositoryConnector.put (BasicRepositoryConnector.java:288)
at org.eclipse.aether.internal.impl.DefaultDeployer.deploy (DefaultDeployer.java:295)
at org.eclipse.aether.internal.impl.DefaultDeployer.deploy (DefaultDeployer.java:213)
at org.eclipse.aether.internal.impl.DefaultRepositorySystem.deploy (DefaultRepositorySystem.java:386)
at org.apache.maven.artifact.deployer.DefaultArtifactDeployer.deploy (DefaultArtifactDeployer.java:142)
at org.apache.maven.plugin.deploy.AbstractDeployMojo.deploy (AbstractDeployMojo.java:171)
at org.apache.maven.plugin.deploy.DeployMojo.deployProject (DeployMojo.java:279)
at org.apache.maven.plugin.deploy.DeployMojo.execute (DeployMojo.java:185)
at org.apache.maven.plugin.DefaultBuildPluginManager.executeMojo (DefaultBuildPluginManager.java:137)
at org.apache.maven.lifecycle.internal.MojoExecutor.doExecute (MojoExecutor.java:301)
at org.apache.maven.lifecycle.internal.MojoExecutor.execute (MojoExecutor.java:211)
at org.apache.maven.lifecycle.internal.MojoExecutor.execute (MojoExecutor.java:165)
at org.apache.maven.lifecycle.internal.MojoExecutor.execute (MojoExecutor.java:157)
at org.apache.maven.lifecycle.internal.LifecycleModuleBuilder.buildProject (LifecycleModuleBuilder.java:121)
at org.apache.maven.lifecycle.internal.LifecycleModuleBuilder.buildProject (LifecycleModuleBuilder.java:81)
at org.apache.maven.lifecycle.internal.builder.singlethreaded.SingleThreadedBuilder.build (SingleThreadedBuilder.java:56)
at org.apache.maven.lifecycle.internal.LifecycleStarter.execute (LifecycleStarter.java:127)
at org.apache.maven.DefaultMaven.doExecute (DefaultMaven.java:294)
at org.apache.maven.DefaultMaven.doExecute (DefaultMaven.java:192)
at org.apache.maven.DefaultMaven.execute (DefaultMaven.java:105)
at org.apache.maven.cli.MavenCli.execute (MavenCli.java:960)
at org.apache.maven.cli.MavenCli.doMain (MavenCli.java:293)
at org.apache.maven.cli.MavenCli.main (MavenCli.java:196)
at jdk.internal.reflect.NativeMethodAccessorImpl.invoke0 (Native Method)
at jdk.internal.reflect.NativeMethodAccessorImpl.invoke (NativeMethodAccessorImpl.java:62)
at jdk.internal.reflect.DelegatingMethodAccessorImpl.invoke (DelegatingMethodAccessorImpl.java:43)
at java.lang.reflect.Method.invoke (Method.java:566)
at org.codehaus.plexus.classworlds.launcher.Launcher.launchEnhanced (Launcher.java:282)
at org.codehaus.plexus.classworlds.launcher.Launcher.launch (Launcher.java:225)
at org.codehaus.plexus.classworlds.launcher.Launcher.mainWithExitCode (Launcher.java:406)
at org.codehaus.plexus.classworlds.launcher.Launcher.main (Launcher.java:347)
[INFO] ------------------------------------------------------------------------
[INFO] Reactor Summary for midPoint Project 4.7.2-SNAPSHOT:
[INFO]
[INFO] midPoint Project ................................... SUCCESS [ 19.446 s]
[INFO] midPoint Infrastructure ............................ SUCCESS [ 0.190 s]
[INFO] midPoint Infrastructure - schema ................... SUCCESS [01:45 min]
[INFO] midPoint Repository ................................ SUCCESS [ 0.106 s]
[INFO] midPoint Repository - api .......................... SUCCESS [ 0.497 s]
[INFO] midPoint Task Manager - api ........................ SUCCESS [ 1.485 s]
[INFO] midPoint Infrastructure - testing utils (lvl 2) .... SUCCESS [ 5.975 s]
[INFO] midPoint Infrastructure - common ................... SUCCESS [ 1.353 s]
[INFO] midPoint Audit - api ............................... SUCCESS [ 0.427 s]
[INFO] midPoint Security - api ............................ SUCCESS [ 0.778 s]
[INFO] midPoint Repository - SQL common support ........... SUCCESS [ 1.374 s]
[INFO] midPoint Repository - sql repository ............... SUCCESS [ 7.529 s]
[INFO] midPoint System Initialization ..................... SUCCESS [ 21.051 s]
[INFO] midPoint Repository - new SQL repository ........... SUCCESS [ 9.214 s]
[INFO] midPoint Repository - sql repository test .......... SUCCESS [ 5.745 s]
[INFO] midPoint Repository Cache .......................... SUCCESS [ 1.544 s]
[INFO] midPoint Audit - logging impl ...................... SUCCESS [ 0.359 s]
[INFO] midPoint Icf Connectors ............................ SUCCESS [ 0.095 s]
[INFO] Dummy Resource ..................................... SUCCESS [ 0.416 s]
[INFO] midPoint Repository - test utils ................... SUCCESS [ 3.870 s]
[INFO] midPoint Security - impl ........................... SUCCESS [ 0.878 s]
[INFO] midPoint Task Manager - Quartz impl ................ SUCCESS [ 2.607 s]
[INFO] midPoint Tools ..................................... SUCCESS [ 0.089 s]
[INFO] midPoint Tools - Ninja ............................. SUCCESS [ 4.851 s]
[INFO] midPoint Tools - custom Spring Boot JAR layout ..... SUCCESS [ 0.265 s]
[INFO] midPoint Infrastructure - pure JAXB schema ......... SUCCESS [ 15.415 s]
[INFO] midPoint Repo Commons .............................. SUCCESS [ 5.227 s]
[INFO] midPoint Security Enforcer - api ................... SUCCESS [ 0.337 s]
[INFO] midPoint Security Enforcer - impl .................. SUCCESS [ 0.699 s]
[INFO] midPoint Provisioning .............................. SUCCESS [ 0.097 s]
[INFO] midPoint Provisioning - api ........................ SUCCESS [ 0.477 s]
[INFO] Unified Connector Framework - api .................. SUCCESS [ 0.495 s]
[INFO] Dummy Connector .................................... SUCCESS [ 0.585 s]
[INFO] Unified Connector Framework - ConnId impl .......... SUCCESS [ 3.290 s]
[INFO] Unified Connector Framework - Built-in impl ........ SUCCESS [ 2.315 s]
[INFO] midPoint Provisioning - impl ....................... SUCCESS [ 6.321 s]
[INFO] midPoint Model ..................................... SUCCESS [ 0.091 s]
[INFO] midPoint Model - api ............................... SUCCESS [ 1.303 s]
[INFO] midPoint Model - common ............................ SUCCESS [ 8.516 s]
[INFO] midPoint Notifications - api ....................... SUCCESS [ 0.489 s]
[INFO] Dummy Connector Fake ............................... SUCCESS [ 0.203 s]
[INFO] midPoint Authentication - api ...................... SUCCESS [ 0.698 s]
[INFO] midPoint Model - test .............................. SUCCESS [ 2.216 s]
[INFO] midPoint Report - api .............................. SUCCESS [ 0.290 s]
[INFO] midPoint Cases - api ............................... SUCCESS [ 0.397 s]
[INFO] midPoint Access Certification - api ................ SUCCESS [ 0.348 s]
[INFO] midPoint Model - impl .............................. SUCCESS [ 15.824 s]
[INFO] midPoint Notifications - impl ...................... SUCCESS [ 2.377 s]
[INFO] midPoint Report - impl ............................. SUCCESS [ 2.803 s]
[INFO] midPoint Model - integration tests ................. SUCCESS [ 9.175 s]
[INFO] midPoint Workflow - api ............................ SUCCESS [ 0.362 s]
[INFO] midPoint Cases - impl .............................. SUCCESS [ 0.857 s]
[INFO] midPoint Workflow - impl ........................... SUCCESS [ 2.945 s]
[INFO] midPoint Access Certification - impl ............... SUCCESS [ 2.430 s]
[INFO] midPoint Authentication - impl ..................... SUCCESS [ 5.265 s]
[INFO] midPoint REST-ish service implementation ........... SUCCESS [ 0.892 s]
[INFO] midPoint Customizations ............................ SUCCESS [ 0.117 s]
[INFO] midPoint User Interface ............................ SUCCESS [ 0.094 s]
[INFO] midPoint User Interface - admin web gui ............ SUCCESS [02:19 min]
[INFO] midPoint Spring Boot JAR ........................... SUCCESS [ 6.640 s]
[INFO] midPoint Testing Infrastructure .................... SUCCESS [ 0.095 s]
[INFO] midPoint Testing - Resource Connection Tests ....... SUCCESS [ 2.553 s]
[INFO] midPoint Testing - Long Tests ...................... SUCCESS [ 0.985 s]
[INFO] midPoint Testing - Story Tests ..................... SUCCESS [ 3.943 s]
[INFO] midPoint Testing - REST API ........................ SUCCESS [ 2.235 s]
[INFO] midPoint Distribution .............................. SUCCESS [ 22.328 s]
[INFO] midPoint API Distribution .......................... SUCCESS [02:52 min]
[INFO] midPoint JavaDoc ................................... FAILURE [01:43 min]
[INFO] ------------------------------------------------------------------------
[INFO] BUILD FAILURE
[INFO] ------------------------------------------------------------------------
[INFO] Total time: 12:26 min
[INFO] Finished at: 2023-07-27T10:25:09Z
[INFO] ------------------------------------------------------------------------
[ERROR] Failed to execute goal org.apache.maven.plugins:maven-deploy-plugin:2.8.2:deploy (default-deploy) on project javadoc: Failed to deploy metadata: Could not transfer metadata com.evolveum.midpoint.infra:test-util:4.7.2-SNAPSHOT/maven-metadata.xml from/to evolveum-nexus (https://nexus.evolveum.com/nexus/content/repositories/snapshots/): transfer failed for https://nexus.evolveum.com/nexus/content/repositories/snapshots/com/evolveum/midpoint/infra/test-util/4.7.2-SNAPSHOT/maven-metadata.xml, status: 500 Server Error -> [Help 1]
[ERROR]
[ERROR] To see the full stack trace of the errors, re-run Maven with the -e switch.
[ERROR] Re-run Maven using the -X switch to enable full debug logging.
[ERROR]
[ERROR] For more information about the errors and possible solutions, please read the following articles:
[ERROR] [Help 1] http://cwiki.apache.org/confluence/display/MAVEN/MojoExecutionException
[ERROR]
[ERROR] After correcting the problems, you can resume the build with the command
[ERROR] mvn <args> -rf :javadoc
[Pipeline] }
[Pipeline] // container
[Pipeline] }
[Pipeline] // stage
[Pipeline] error
[Pipeline] step
More information about the midPoint-ci
mailing list