[midPoint-ci] Build failed in Jenkins: midPoint - master - main build, JDK 17 #879

Jenkins noreply at evolveum.com
Wed Apr 10 12:12:53 CEST 2024


See <https://jenkins.evolveum.com/job/midpoint-master-main-jdk17/879/display/redirect>

Changes:


------------------------------------------
[...truncated 4679 lines...]
[INFO] <s> [webpack.Progress] 93% sealing after asset optimization
[INFO] <s> [webpack.Progress] 93% sealing recording
[INFO] <s> [webpack.Progress] 93% sealing recording
[INFO] <s> [webpack.Progress] 94% sealing after seal
[INFO] <s> [webpack.Progress] 94% sealing after seal
[INFO] <s> [webpack.Progress] 95% emitting emit
[INFO] <s> [webpack.Progress] 95% emitting emit
[INFO] <s> [webpack.Progress] 98% emitting after emit
[INFO] <s> [webpack.Progress] 98% emitting after emit SizeLimitsPlugin
[INFO] <s> [webpack.Progress] 98% emitting after emit
[INFO] <s> [webpack.Progress] 99% done plugins
[INFO] <s> [webpack.Progress] 99% done plugins
[INFO] <s> [webpack.Progress] 99% 
[INFO] 
[INFO] <s> [webpack.Progress] 99% cache store build dependencies
[INFO] <s> [webpack.Progress] 99% cache store build dependencies
[INFO] <s> [webpack.Progress] 99% cache begin idle
[INFO] <s> [webpack.Progress] 99% cache begin idle
[INFO] <s> [webpack.Progress] 100% 
[INFO] 
[INFO] <s> [webpack.Progress] 99% cache shutdown
[INFO] <s> [webpack.Progress] 99% cache shutdown
[INFO] <s> [webpack.Progress] 100% 
[INFO] 
[INFO] assets by path ./*.js 3.36 MiB
[INFO]   assets by status 3.23 MiB [big]
[INFO]     asset ./vendors-passwords.js 1.85 MiB [emitted] [minimized] [big] (name: vendors-passwords)
[INFO]     asset ./vendors.js 1.39 MiB [emitted] [minimized] [big] (name: vendors) 1 related asset
[INFO]   asset ./midpoint.js 114 KiB [emitted] [minimized] (name: midpoint) 1 related asset
[INFO]   asset ./492.js 19.9 KiB [emitted] [minimized] (id hint: vendors)
[INFO]   asset ./vendors-fonts.js 0 bytes [emitted] [minimized] (name: vendors-fonts)
[INFO] assets by path *.css 14.1 MiB
[INFO]   asset vendors.css 7.77 MiB [emitted] [minimized] [big] (name: vendors)
[INFO]   asset vendors-fonts.css 6.28 MiB [emitted] [minimized] [big] (name: vendors-fonts)
[INFO]   asset midpoint.css 72 KiB [emitted] [minimized] (name: midpoint)
[INFO] assets by path img/*.png 12.3 KiB
[INFO]   asset img/midpoint_logo_white_250x.png 7.92 KiB [emitted] [from: src/frontend/img/midpoint_logo_white_250x.png] (auxiliary name: midpoint)
[INFO]   asset img/midpoint_logo_white_56x.png 4.35 KiB [emitted] [from: src/frontend/img/midpoint_logo_white_56x.png] (auxiliary name: midpoint)
[INFO] asset worker-xml.js 43.9 KiB [emitted] [from: node_modules/ace-builds/src-noconflict/worker-xml.js] [minimized] (auxiliary name: vendors)
[INFO] Entrypoint vendors [big] 9.16 MiB (43.9 KiB) = vendors.css 7.77 MiB ./vendors.js 1.39 MiB 1 auxiliary asset
[INFO] Entrypoint vendors-passwords [big] 1.85 MiB = ./vendors-passwords.js
[INFO] Entrypoint vendors-fonts [big] 6.28 MiB = vendors-fonts.css 6.28 MiB ./vendors-fonts.js 0 bytes
[INFO] Entrypoint midpoint 186 KiB (12.3 KiB) = midpoint.css 72 KiB ./midpoint.js 114 KiB 2 auxiliary assets
[INFO] orphan modules 11 MiB (javascript) 12.3 KiB (asset) 3.02 KiB (runtime) [orphan] 746 modules
[INFO] runtime modules 12.4 KiB 24 modules
[INFO] built modules 5.38 MiB (javascript) 14.8 MiB (css/mini-extract) [built]
[INFO]   modules by path ./node_modules/moment/ 1.21 MiB 274 modules
[INFO]   css modules 14.8 MiB
[INFO]     modules by path ./node_modules/ 13.2 MiB 14 modules
[INFO]     modules by path ./src/frontend/ 1.64 MiB 3 modules
[INFO]   modules by path ./src/frontend/js/ 2.49 MiB 7 modules
[INFO]   modules by path ./node_modules/ace-builds/src-noconflict/*.js 825 KiB
[INFO]     ./node_modules/ace-builds/src-noconflict/ace.js 704 KiB [built] [code generated]
[INFO]       487 ms ->
[INFO]       0 ms (resolving: 0 ms, restoring: 0 ms, integration: 0 ms, building: 0 ms, storing: 0 ms)
[INFO]     + 6 modules
[INFO]   modules by path ./node_modules/admin-lte/ 262 KiB
[INFO]     ./node_modules/admin-lte/plugins/bootstrap/js/bootstrap.js 134 KiB [built] [code generated]
[INFO]       487 ms ->
[INFO]       0 ms (resolving: 0 ms, restoring: 0 ms, integration: 0 ms, building: 0 ms, storing: 0 ms)
[INFO]     + 2 modules
[INFO]   + 11 modules
[INFO] 
[INFO] LOG from webpack.Compilation.ModuleProfile
[INFO] <i>  | 432 ms (parallelism 12.9) resolve to new modules > ./node_modules/@popperjs/core/lib/index.js
[INFO] <i>  | 450 ms (parallelism 12.9) resolve to new modules > ./node_modules/@eonasdan/tempus-dominus/dist/js/tempus-dominus.esm.js
[INFO] <i> 1713 ms resolve to new modules
[INFO] <i>  | 408 ms (parallelism 12.3) resolve to existing modules > ./node_modules/@eonasdan/tempus-dominus/dist/js/tempus-dominus.esm.js
[INFO] <i> 594 ms resolve to existing modules
[INFO] <e>  |  | 1176 ms (parallelism 13.6) build modules > ./src/frontend/scss/vendors-fonts.scss
[INFO] <e>  |  | 1139 ms (parallelism 14.7) build modules > ./src/frontend/scss/vendors.scss
[INFO] <e>  |  | 1021 ms (parallelism 14.1) build modules > ./src/frontend/scss/midpoint.scss
[INFO] <e>  | 3336 ms build modules > 3 x javascript/auto with ./node_modules/mini-css-extract-plugin/dist/loader.js!./node_modules/css-loader/dist/cjs.js??ruleSet[1].rules[0].use[1]!./node_modules/postcss-loader/dist/cjs.js!./node_modules/sass-loader/dist/cjs.js??ruleSet[1].rules[0].use[3]
[INFO] <i>  |  | 434 ms (parallelism 12.9) build modules > ./src/frontend/js/password-score/password-score-options.js
[INFO] <i>  | 716 ms build modules > 9 x javascript/auto with ./node_modules/babel-loader/lib/index.js
[INFO] <i>  |  | 424 ms (parallelism 17.8) build modules > ./src/frontend/scss/vendors-fonts.scss.webpack[javascript/auto]!=!./node_modules/css-loader/dist/cjs.js??ruleSet[1].rules[0].use[1]!./node_modules/postcss-loader/dist/cjs.js!./node_modules/sass-loader/dist/cjs.js??ruleSet[1].rules[0].use[3]!./src/frontend/scss/vendors-fonts.scss
[INFO] <e>  |  | 1093 ms (parallelism 13.7) build modules > ./src/frontend/scss/vendors.scss.webpack[javascript/auto]!=!./node_modules/css-loader/dist/cjs.js??ruleSet[1].rules[0].use[1]!./node_modules/postcss-loader/dist/cjs.js!./node_modules/sass-loader/dist/cjs.js??ruleSet[1].rules[0].use[3]!./src/frontend/scss/vendors.scss
[INFO] <w>  |  | 984 ms (parallelism 14.2) build modules > ./src/frontend/scss/midpoint.scss.webpack[javascript/auto]!=!./node_modules/css-loader/dist/cjs.js??ruleSet[1].rules[0].use[1]!./node_modules/postcss-loader/dist/cjs.js!./node_modules/sass-loader/dist/cjs.js??ruleSet[1].rules[0].use[3]!./src/frontend/scss/midpoint.scss
[INFO] <w>  |  | 707 ms (parallelism 9.9) build modules > ./node_modules/css-loader/dist/cjs.js??ruleSet[1].rules[0].use[1]!./node_modules/postcss-loader/dist/cjs.js!./node_modules/sass-loader/dist/cjs.js??ruleSet[1].rules[0].use[3]!./node_modules/@fontsource/source-sans-pro/300.css
[INFO] <w>  |  | 707 ms (parallelism 9.9) build modules > ./node_modules/css-loader/dist/cjs.js??ruleSet[1].rules[0].use[1]!./node_modules/postcss-loader/dist/cjs.js!./node_modules/sass-loader/dist/cjs.js??ruleSet[1].rules[0].use[3]!./node_modules/@fontsource/source-sans-pro/400.css
[INFO] <w>  |  | 707 ms (parallelism 9.9) build modules > ./node_modules/css-loader/dist/cjs.js??ruleSet[1].rules[0].use[1]!./node_modules/postcss-loader/dist/cjs.js!./node_modules/sass-loader/dist/cjs.js??ruleSet[1].rules[0].use[3]!./node_modules/@fontsource/source-sans-pro/400-italic.css
[INFO] <w>  |  | 707 ms (parallelism 9.9) build modules > ./node_modules/css-loader/dist/cjs.js??ruleSet[1].rules[0].use[1]!./node_modules/postcss-loader/dist/cjs.js!./node_modules/sass-loader/dist/cjs.js??ruleSet[1].rules[0].use[3]!./node_modules/@fontsource/source-sans-pro/700.css
[INFO] <w>  |  | 777 ms (parallelism 9.6) build modules > ./node_modules/css-loader/dist/cjs.js??ruleSet[1].rules[0].use[1]!./node_modules/postcss-loader/dist/cjs.js!./node_modules/sass-loader/dist/cjs.js??ruleSet[1].rules[0].use[3]!./node_modules/@fortawesome/fontawesome-free/css/all.css
[INFO] <e>  | 6437 ms build modules > 17 x javascript/auto with ./node_modules/css-loader/dist/cjs.js??ruleSet[1].rules[0].use[1]!./node_modules/postcss-loader/dist/cjs.js!./node_modules/sass-loader/dist/cjs.js??ruleSet[1].rules[0].use[3]
[INFO] <i>  |  | 357 ms (parallelism 12) build modules > ./node_modules/select2/dist/js/select2.js
[INFO] <i>  | 693 ms build modules > 349 x javascript/auto
[INFO] <e> 11548 ms build modules
[INFO] + 42 hidden lines
[INFO] 
[INFO] WARNING in ./src/frontend/js/midpoint.js 13:16-22
[INFO] export 'default' (imported as 'Popper') was not found in '@popperjs/core' (possible exports: afterMain, afterRead, afterWrite, applyStyles, arrow, auto, basePlacements, beforeMain, beforeRead, beforeWrite, bottom, clippingParents, computeStyles, createPopper, createPopperBase, createPopperLite, detectOverflow, end, eventListeners, flip, hide, left, main, modifierPhases, offset, placements, popper, popperGenerator, popperOffsets, preventOverflow, read, reference, right, start, top, variationPlacements, viewport, write)
[INFO] 
[INFO] webpack 5.76.0 compiled with 1 warning in 55000 ms
[INFO] 
[INFO] --- maven-resources-plugin:3.1.0:resources (default-resources) @ admin-gui ---
[INFO] Using 'UTF-8' encoding to copy filtered resources.
[INFO] Copying 54 resources
[INFO] Copying 1 resource
[INFO] Copying 1 resource to META-INF/services
[INFO] Copying 649 resources
[INFO] Copying 0 resource
[INFO] Copying 13 resources
[INFO] 
[INFO] --- maven-compiler-plugin:3.11.0:compile (default-compile) @ admin-gui ---
[INFO] Changes detected - recompiling the module! :dependency
[INFO] Compiling 1794 source files with javac [debug target 17] to target/classes
[INFO] /home/jenkins/agent/workspace/midpoint-master-main-jdk17/gui/admin-gui/src/main/java/com/evolveum/midpoint/gui/api/page/PageAdminLTE.java: Some input files use or override a deprecated API.
[INFO] /home/jenkins/agent/workspace/midpoint-master-main-jdk17/gui/admin-gui/src/main/java/com/evolveum/midpoint/gui/api/page/PageAdminLTE.java: Recompile with -Xlint:deprecation for details.
[INFO] /home/jenkins/agent/workspace/midpoint-master-main-jdk17/gui/admin-gui/src/main/java/com/evolveum/midpoint/gui/api/page/PageBase.java: Some input files use unchecked or unsafe operations.
[INFO] /home/jenkins/agent/workspace/midpoint-master-main-jdk17/gui/admin-gui/src/main/java/com/evolveum/midpoint/gui/api/page/PageBase.java: Recompile with -Xlint:unchecked for details.
[INFO] -------------------------------------------------------------
[WARNING] COMPILATION WARNING : 
[INFO] -------------------------------------------------------------
[WARNING] /home/jenkins/agent/workspace/midpoint-master-main-jdk17/gui/admin-gui/src/main/java/com/evolveum/midpoint/gui/impl/page/admin/resource/component/ResourceTasksPanel.java:[9,61] com.evolveum.midpoint.web.page.admin.resources.ResourceContentPanel in com.evolveum.midpoint.web.page.admin.resources has been deprecated and marked for removal
[WARNING] /home/jenkins/agent/workspace/midpoint-master-main-jdk17/gui/admin-gui/src/main/java/com/evolveum/midpoint/web/page/admin/resources/ResourceContentRepositoryPanel.java:[39,53] com.evolveum.midpoint.web.page.admin.resources.ResourceContentPanel in com.evolveum.midpoint.web.page.admin.resources has been deprecated and marked for removal
[WARNING] /home/jenkins/agent/workspace/midpoint-master-main-jdk17/gui/admin-gui/src/main/java/com/evolveum/midpoint/gui/impl/component/input/SourceMappingProvider.java:[101,101] non-varargs call of varargs method with inexact argument type for last parameter;
  cast to java.lang.Object for a varargs call
  cast to java.lang.Object[] for a non-varargs call and to suppress this warning
[WARNING] /home/jenkins/agent/workspace/midpoint-master-main-jdk17/gui/admin-gui/src/main/java/com/evolveum/midpoint/web/page/admin/resources/ResourceContentResourcePanel.java:[24,51] com.evolveum.midpoint.web.page.admin.resources.ResourceContentPanel in com.evolveum.midpoint.web.page.admin.resources has been deprecated and marked for removal
[WARNING] /home/jenkins/agent/workspace/midpoint-master-main-jdk17/gui/admin-gui/src/main/java/com/evolveum/midpoint/gui/impl/page/admin/resource/component/ResourceContentPanel.java:[610,59] com.evolveum.midpoint.web.page.admin.resources.ResourceContentPanel in com.evolveum.midpoint.web.page.admin.resources has been deprecated and marked for removal
[WARNING] /home/jenkins/agent/workspace/midpoint-master-main-jdk17/gui/admin-gui/src/main/java/com/evolveum/midpoint/gui/impl/page/admin/resource/component/ResourceContentPanel.java:[618,13] com.evolveum.midpoint.web.page.admin.resources.ResourceContentResourcePanel in com.evolveum.midpoint.web.page.admin.resources has been deprecated and marked for removal
[WARNING] /home/jenkins/agent/workspace/midpoint-master-main-jdk17/gui/admin-gui/src/main/java/com/evolveum/midpoint/gui/impl/page/admin/resource/component/ResourceContentPanel.java:[621,9] com.evolveum.midpoint.web.page.admin.resources.ResourceContentResourcePanel in com.evolveum.midpoint.web.page.admin.resources has been deprecated and marked for removal
[WARNING] /home/jenkins/agent/workspace/midpoint-master-main-jdk17/gui/admin-gui/src/main/java/com/evolveum/midpoint/gui/impl/page/admin/resource/component/ResourceContentPanel.java:[621,60] com.evolveum.midpoint.web.page.admin.resources.ResourceContentResourcePanel in com.evolveum.midpoint.web.page.admin.resources has been deprecated and marked for removal
[WARNING] /home/jenkins/agent/workspace/midpoint-master-main-jdk17/gui/admin-gui/src/main/java/com/evolveum/midpoint/gui/impl/page/admin/resource/component/ResourceContentPanel.java:[666,13] com.evolveum.midpoint.web.page.admin.resources.ResourceContentRepositoryPanel in com.evolveum.midpoint.web.page.admin.resources has been deprecated and marked for removal
[WARNING] /home/jenkins/agent/workspace/midpoint-master-main-jdk17/gui/admin-gui/src/main/java/com/evolveum/midpoint/gui/impl/page/admin/resource/component/ResourceContentPanel.java:[669,9] com.evolveum.midpoint.web.page.admin.resources.ResourceContentRepositoryPanel in com.evolveum.midpoint.web.page.admin.resources has been deprecated and marked for removal
[WARNING] /home/jenkins/agent/workspace/midpoint-master-main-jdk17/gui/admin-gui/src/main/java/com/evolveum/midpoint/gui/impl/page/admin/resource/component/ResourceContentPanel.java:[669,64] com.evolveum.midpoint.web.page.admin.resources.ResourceContentRepositoryPanel in com.evolveum.midpoint.web.page.admin.resources has been deprecated and marked for removal
[WARNING] /home/jenkins/agent/workspace/midpoint-master-main-jdk17/gui/admin-gui/src/main/java/com/evolveum/midpoint/gui/impl/page/admin/resource/component/ResourceContentPanel.java:[784,55] com.evolveum.midpoint.web.page.admin.resources.ResourceContentPanel in com.evolveum.midpoint.web.page.admin.resources has been deprecated and marked for removal
[WARNING] /home/jenkins/agent/workspace/midpoint-master-main-jdk17/gui/admin-gui/src/main/java/com/evolveum/midpoint/gui/impl/page/admin/resource/component/ResourceContentPanel.java:[785,64] com.evolveum.midpoint.web.page.admin.resources.ResourceContentPanel in com.evolveum.midpoint.web.page.admin.resources has been deprecated and marked for removal
[INFO] 13 warnings 
[INFO] -------------------------------------------------------------
[INFO] -------------------------------------------------------------
[ERROR] COMPILATION ERROR : 
[INFO] -------------------------------------------------------------
[ERROR] /home/jenkins/agent/workspace/midpoint-master-main-jdk17/gui/admin-gui/src/main/java/com/evolveum/midpoint/gui/impl/duplication/DuplicationProcessHelper.java:[4,44] cannot find symbol
  symbol:   class Source
  location: package com.evolveum.midpoint.common.cleanup
[ERROR] /home/jenkins/agent/workspace/midpoint-master-main-jdk17/gui/admin-gui/src/main/java/com/evolveum/midpoint/gui/impl/duplication/DuplicationProcessHelper.java:[132,45] cannot find symbol
  symbol:   variable Source
  location: class com.evolveum.midpoint.gui.impl.duplication.DuplicationProcessHelper
[ERROR] /home/jenkins/agent/workspace/midpoint-master-main-jdk17/gui/admin-gui/src/main/java/com/evolveum/midpoint/gui/impl/duplication/DuplicationProcessHelper.java:[147,45] cannot find symbol
  symbol:   variable Source
  location: class com.evolveum.midpoint.gui.impl.duplication.DuplicationProcessHelper
[INFO] 3 errors 
[INFO] -------------------------------------------------------------
[INFO] ------------------------------------------------------------------------
[INFO] Reactor Summary for midPoint Project 4.9-SNAPSHOT:
[INFO] 
[INFO] midPoint Project ................................... SUCCESS [ 23.530 s]
[INFO] midPoint Infrastructure ............................ SUCCESS [  0.263 s]
[INFO] midPoint Infrastructure - schema ................... SUCCESS [01:40 min]
[INFO] midPoint Repository ................................ SUCCESS [  0.197 s]
[INFO] midPoint Repository - api .......................... SUCCESS [  0.759 s]
[INFO] midPoint Task Manager - api ........................ SUCCESS [  1.400 s]
[INFO] midPoint Infrastructure - testing utils (lvl 2) .... SUCCESS [  6.683 s]
[INFO] midPoint Infrastructure - common ................... SUCCESS [  2.145 s]
[INFO] midPoint Audit - api ............................... SUCCESS [  0.559 s]
[INFO] midPoint Security - api ............................ SUCCESS [  1.146 s]
[INFO] midPoint Repository - SQL common support ........... SUCCESS [  1.335 s]
[INFO] midPoint Repository - sql repository ............... SUCCESS [  7.781 s]
[INFO] midPoint System Initialization ..................... SUCCESS [ 23.393 s]
[INFO] midPoint Repository - new SQL repository ........... SUCCESS [  8.114 s]
[INFO] midPoint Repository - sql repository test .......... SUCCESS [  6.215 s]
[INFO] midPoint Repository Cache .......................... SUCCESS [  4.367 s]
[INFO] midPoint Audit - logging impl ...................... SUCCESS [  0.416 s]
[INFO] midPoint Icf Connectors ............................ SUCCESS [  0.188 s]
[INFO] Dummy Resource ..................................... SUCCESS [  0.595 s]
[INFO] midPoint Repository - test utils ................... SUCCESS [  5.760 s]
[INFO] midPoint Security - impl ........................... SUCCESS [  1.094 s]
[INFO] midPoint Task Manager - Quartz impl ................ SUCCESS [  2.586 s]
[INFO] midPoint Tools ..................................... SUCCESS [  0.172 s]
[INFO] midPoint Tools - Ninja ............................. SUCCESS [  5.685 s]
[INFO] midPoint Tools - custom Spring Boot JAR layout ..... SUCCESS [  0.423 s]
[INFO] midPoint Infrastructure - pure JAXB schema ......... SUCCESS [ 12.562 s]
[INFO] midPoint Repo Commons .............................. SUCCESS [  4.379 s]
[INFO] midPoint Security Enforcer - api ................... SUCCESS [  0.472 s]
[INFO] midPoint Security Enforcer - impl .................. SUCCESS [  0.847 s]
[INFO] midPoint Provisioning .............................. SUCCESS [  0.209 s]
[INFO] midPoint Provisioning - api ........................ SUCCESS [  0.663 s]
[INFO] Unified Connector Framework - api .................. SUCCESS [  0.650 s]
[INFO] Dummy Connector .................................... SUCCESS [  0.790 s]
[INFO] Unified Connector Framework - ConnId impl .......... SUCCESS [  3.840 s]
[INFO] Unified Connector Framework - Built-in impl ........ SUCCESS [  2.567 s]
[INFO] midPoint Provisioning - impl ....................... SUCCESS [  6.657 s]
[INFO] midPoint Model ..................................... SUCCESS [  0.196 s]
[INFO] midPoint Model - api ............................... SUCCESS [  1.789 s]
[INFO] midPoint Model - common ............................ SUCCESS [  8.671 s]
[INFO] midPoint Notifications - api ....................... SUCCESS [  1.073 s]
[INFO] Dummy Connector Fake ............................... SUCCESS [  0.292 s]
[INFO] midPoint Authentication - api ...................... SUCCESS [  0.844 s]
[INFO] midPoint Model - test .............................. SUCCESS [  2.214 s]
[INFO] midPoint Report - api .............................. SUCCESS [  0.348 s]
[INFO] midPoint Cases - api ............................... SUCCESS [  0.550 s]
[INFO] midPoint Access Certification - api ................ SUCCESS [  0.418 s]
[INFO] midPoint Model - impl .............................. SUCCESS [ 14.597 s]
[INFO] midPoint Notifications - impl ...................... SUCCESS [  3.217 s]
[INFO] midPoint Report - impl ............................. SUCCESS [  2.394 s]
[INFO] midPoint Model - integration tests ................. SUCCESS [  8.414 s]
[INFO] midPoint Workflow - api ............................ SUCCESS [  0.418 s]
[INFO] midPoint Cases - impl .............................. SUCCESS [  0.868 s]
[INFO] midPoint Workflow - impl ........................... SUCCESS [  2.870 s]
[INFO] midPoint Access Certification - impl ............... SUCCESS [  2.216 s]
[INFO] midPoint Authentication - impl ..................... SUCCESS [  6.380 s]
[INFO] midPoint REST-ish service implementation ........... SUCCESS [  0.698 s]
[INFO] midPoint Customizations ............................ SUCCESS [  0.184 s]
[INFO] midPoint User Interface ............................ SUCCESS [  0.234 s]
[INFO] midPoint User Interface - admin web gui ............ FAILURE [01:53 min]
[INFO] midPoint Spring Boot JAR ........................... SKIPPED
[INFO] midPoint Testing Infrastructure .................... SKIPPED
[INFO] midPoint Testing - Resource Connection Tests ....... SKIPPED
[INFO] midPoint Testing - Long Tests ...................... SKIPPED
[INFO] midPoint Testing - Story Tests ..................... SKIPPED
[INFO] midPoint Testing - REST API ........................ SKIPPED
[INFO] midPoint Distribution .............................. SKIPPED
[INFO] midPoint API Distribution .......................... SKIPPED
[INFO] midPoint JavaDoc ................................... SKIPPED
[INFO] ------------------------------------------------------------------------
[INFO] BUILD FAILURE
[INFO] ------------------------------------------------------------------------
[INFO] Total time:  06:54 min
[INFO] Finished at: 2024-04-10T10:12:49Z
[INFO] ------------------------------------------------------------------------
[ERROR] Failed to execute goal org.apache.maven.plugins:maven-compiler-plugin:3.11.0:compile (default-compile) on project admin-gui: Compilation failure: Compilation failure: 
[ERROR] /home/jenkins/agent/workspace/midpoint-master-main-jdk17/gui/admin-gui/src/main/java/com/evolveum/midpoint/gui/impl/duplication/DuplicationProcessHelper.java:[4,44] cannot find symbol
[ERROR]   symbol:   class Source
[ERROR]   location: package com.evolveum.midpoint.common.cleanup
[ERROR] /home/jenkins/agent/workspace/midpoint-master-main-jdk17/gui/admin-gui/src/main/java/com/evolveum/midpoint/gui/impl/duplication/DuplicationProcessHelper.java:[132,45] cannot find symbol
[ERROR]   symbol:   variable Source
[ERROR]   location: class com.evolveum.midpoint.gui.impl.duplication.DuplicationProcessHelper
[ERROR] /home/jenkins/agent/workspace/midpoint-master-main-jdk17/gui/admin-gui/src/main/java/com/evolveum/midpoint/gui/impl/duplication/DuplicationProcessHelper.java:[147,45] cannot find symbol
[ERROR]   symbol:   variable Source
[ERROR]   location: class com.evolveum.midpoint.gui.impl.duplication.DuplicationProcessHelper
[ERROR] -> [Help 1]
[ERROR] 
[ERROR] To see the full stack trace of the errors, re-run Maven with the -e switch.
[ERROR] Re-run Maven using the -X switch to enable full debug logging.
[ERROR] 
[ERROR] For more information about the errors and possible solutions, please read the following articles:
[ERROR] [Help 1] http://cwiki.apache.org/confluence/display/MAVEN/MojoFailureException
[ERROR] 
[ERROR] After correcting the problems, you can resume the build with the command
[ERROR]   mvn <args> -rf :admin-gui
[Pipeline] }
[Pipeline] // withCredentials
[Pipeline] }
[Pipeline] // container
[Pipeline] }
[Pipeline] // stage
[Pipeline] error
[Pipeline] step


More information about the midPoint-ci mailing list