[midPoint-ci] Build failed in Jenkins: midPoint - master - Generic repo, PG 13, JDK 17 #225

Jenkins noreply at evolveum.com
Fri Jun 30 18:42:57 CEST 2023


See <https://jenkins.evolveum.com/job/midpoint-master-generic-pg13-jdk17/225/display/redirect>

Changes:


------------------------------------------
[...truncated 3595 lines...]
[INFO] Tests run: 367, Failures: 0, Errors: 0, Skipped: 0, Time elapsed: 31.75 s -- in Unit
[INFO] 
[INFO] Results:
[INFO] 
[INFO] Tests run: 367, Failures: 0, Errors: 0, Skipped: 0
[INFO] 
[INFO] 
[INFO] --- maven-jar-plugin:3.3.0:jar (default-jar) @ model-common ---
[INFO] Building jar: /home/jenkins/agent/workspace/midpoint-master-generic-pg13-jdk17/model/model-common/target/model-common-4.8-SNAPSHOT.jar
[INFO] 
[INFO] >>> maven-source-plugin:3.1.0:jar (attach-sources) > generate-sources @ model-common >>>
[INFO] 
[INFO] --- maven-enforcer-plugin:3.1.0:enforce (enforce) @ model-common ---
[INFO] 
[INFO] --- maven-checkstyle-plugin:3.1.2:check (validate) @ model-common ---
[INFO] Starting audit...
Audit done.
[INFO] You have 0 Checkstyle violations.
[INFO] 
[INFO] --- gitdescribe-maven-plugin:3.0:gitdescribe (git-describe) @ model-common ---
[INFO] 
[INFO] <<< maven-source-plugin:3.1.0:jar (attach-sources) < generate-sources @ model-common <<<
[INFO] 
[INFO] 
[INFO] --- maven-source-plugin:3.1.0:jar (attach-sources) @ model-common ---
[INFO] Building jar: /home/jenkins/agent/workspace/midpoint-master-generic-pg13-jdk17/model/model-common/target/model-common-4.8-SNAPSHOT-sources.jar
[INFO] 
[INFO] --- maven-dependency-plugin:3.3.0:analyze-only (analyze) @ model-common ---
[INFO] No dependency problems found
[INFO] 
[INFO] --- maven-install-plugin:3.0.1:install (default-install) @ model-common ---
[INFO] Installing /home/jenkins/agent/workspace/midpoint-master-generic-pg13-jdk17/model/model-common/pom.xml to /root/.m2/repository/com/evolveum/midpoint/model/model-common/4.8-SNAPSHOT/model-common-4.8-SNAPSHOT.pom
[INFO] Installing /home/jenkins/agent/workspace/midpoint-master-generic-pg13-jdk17/model/model-common/target/model-common-4.8-SNAPSHOT.jar to /root/.m2/repository/com/evolveum/midpoint/model/model-common/4.8-SNAPSHOT/model-common-4.8-SNAPSHOT.jar
[INFO] Installing /home/jenkins/agent/workspace/midpoint-master-generic-pg13-jdk17/model/model-common/target/model-common-4.8-SNAPSHOT-sources.jar to /root/.m2/repository/com/evolveum/midpoint/model/model-common/4.8-SNAPSHOT/model-common-4.8-SNAPSHOT-sources.jar
[INFO] 
[INFO] -----------< com.evolveum.midpoint.model:notifications-api >------------
[INFO] Building midPoint Notifications - api 4.8-SNAPSHOT               [39/63]
[INFO] --------------------------------[ jar ]---------------------------------
[INFO] 
[INFO] --- maven-clean-plugin:3.2.0:clean (default-clean) @ notifications-api ---
[INFO] 
[INFO] --- maven-enforcer-plugin:3.1.0:enforce (enforce) @ notifications-api ---
[INFO] 
[INFO] --- maven-checkstyle-plugin:3.1.2:check (validate) @ notifications-api ---
[INFO] Starting audit...
Audit done.
[INFO] You have 0 Checkstyle violations.
[INFO] 
[INFO] --- gitdescribe-maven-plugin:3.0:gitdescribe (git-describe) @ notifications-api ---
[INFO] Setting Git Describe: v4.8devel-461-g0b73d3687d7
[INFO] 
[INFO] --- maven-resources-plugin:3.1.0:resources (default-resources) @ notifications-api ---
[INFO] Using 'UTF-8' encoding to copy filtered resources.
[INFO] skip non existing resourceDirectory /home/jenkins/agent/workspace/midpoint-master-generic-pg13-jdk17/model/notifications-api/src/main/resources
[INFO] 
[INFO] --- maven-compiler-plugin:3.11.0:compile (default-compile) @ notifications-api ---
[INFO] Changes detected - recompiling the module! :dependency
[INFO] Compiling 28 source files with javac [debug target 17] to target/classes
[INFO] 
[INFO] --- maven-resources-plugin:3.1.0:testResources (default-testResources) @ notifications-api ---
[INFO] Not copying test resources
[INFO] 
[INFO] --- maven-compiler-plugin:3.11.0:testCompile (default-testCompile) @ notifications-api ---
[INFO] Not compiling test sources
[INFO] 
[INFO] --- maven-surefire-plugin:3.1.2:test (default-test) @ notifications-api ---
[INFO] Tests are skipped.
[INFO] 
[INFO] --- maven-jar-plugin:3.3.0:jar (default-jar) @ notifications-api ---
[INFO] Building jar: /home/jenkins/agent/workspace/midpoint-master-generic-pg13-jdk17/model/notifications-api/target/notifications-api-4.8-SNAPSHOT.jar
[INFO] 
[INFO] >>> maven-source-plugin:3.1.0:jar (attach-sources) > generate-sources @ notifications-api >>>
[INFO] 
[INFO] --- maven-enforcer-plugin:3.1.0:enforce (enforce) @ notifications-api ---
[INFO] 
[INFO] --- maven-checkstyle-plugin:3.1.2:check (validate) @ notifications-api ---
[INFO] Starting audit...
Audit done.
[INFO] You have 0 Checkstyle violations.
[INFO] 
[INFO] --- gitdescribe-maven-plugin:3.0:gitdescribe (git-describe) @ notifications-api ---
[INFO] 
[INFO] <<< maven-source-plugin:3.1.0:jar (attach-sources) < generate-sources @ notifications-api <<<
[INFO] 
[INFO] 
[INFO] --- maven-source-plugin:3.1.0:jar (attach-sources) @ notifications-api ---
[INFO] Building jar: /home/jenkins/agent/workspace/midpoint-master-generic-pg13-jdk17/model/notifications-api/target/notifications-api-4.8-SNAPSHOT-sources.jar
[INFO] 
[INFO] --- maven-dependency-plugin:3.3.0:analyze-only (analyze) @ notifications-api ---
[INFO] No dependency problems found
[INFO] 
[INFO] --- maven-install-plugin:3.0.1:install (default-install) @ notifications-api ---
[INFO] Installing /home/jenkins/agent/workspace/midpoint-master-generic-pg13-jdk17/model/notifications-api/pom.xml to /root/.m2/repository/com/evolveum/midpoint/model/notifications-api/4.8-SNAPSHOT/notifications-api-4.8-SNAPSHOT.pom
[INFO] Installing /home/jenkins/agent/workspace/midpoint-master-generic-pg13-jdk17/model/notifications-api/target/notifications-api-4.8-SNAPSHOT.jar to /root/.m2/repository/com/evolveum/midpoint/model/notifications-api/4.8-SNAPSHOT/notifications-api-4.8-SNAPSHOT.jar
[INFO] Installing /home/jenkins/agent/workspace/midpoint-master-generic-pg13-jdk17/model/notifications-api/target/notifications-api-4.8-SNAPSHOT-sources.jar to /root/.m2/repository/com/evolveum/midpoint/model/notifications-api/4.8-SNAPSHOT/notifications-api-4.8-SNAPSHOT-sources.jar
[INFO] 
[INFO] ---------------< com.evolveum.icf:dummy-connector-fake >----------------
[INFO] Building Dummy Connector Fake 4.8-SNAPSHOT                       [40/63]
[INFO] --------------------------------[ jar ]---------------------------------
[INFO] 
[INFO] --- maven-clean-plugin:3.2.0:clean (default-clean) @ dummy-connector-fake ---
[INFO] 
[INFO] --- maven-enforcer-plugin:3.1.0:enforce (enforce) @ dummy-connector-fake ---
[INFO] 
[INFO] --- maven-checkstyle-plugin:3.1.2:check (validate) @ dummy-connector-fake ---
[INFO] Starting audit...
Audit done.
[INFO] You have 0 Checkstyle violations.
[INFO] 
[INFO] --- gitdescribe-maven-plugin:3.0:gitdescribe (git-describe) @ dummy-connector-fake ---
[INFO] Setting Git Describe: v4.8devel-461-g0b73d3687d7
[INFO] 
[INFO] --- maven-resources-plugin:3.1.0:resources (default-resources) @ dummy-connector-fake ---
[INFO] Using 'UTF-8' encoding to copy filtered resources.
[INFO] skip non existing resourceDirectory /home/jenkins/agent/workspace/midpoint-master-generic-pg13-jdk17/icf-connectors/dummy-connector-fake/src/main/resources
[INFO] 
[INFO] --- maven-compiler-plugin:3.11.0:compile (default-compile) @ dummy-connector-fake ---
[INFO] Changes detected - recompiling the module! :dependency
[INFO] Compiling 3 source files with javac [debug target 17] to target/classes
[INFO] 
[INFO] --- maven-resources-plugin:3.1.0:testResources (default-testResources) @ dummy-connector-fake ---
[INFO] Not copying test resources
[INFO] 
[INFO] --- maven-compiler-plugin:3.11.0:testCompile (default-testCompile) @ dummy-connector-fake ---
[INFO] Not compiling test sources
[INFO] 
[INFO] --- maven-surefire-plugin:3.1.2:test (default-test) @ dummy-connector-fake ---
[INFO] Tests are skipped.
[INFO] 
[INFO] --- maven-jar-plugin:3.3.0:jar (default-jar) @ dummy-connector-fake ---
[INFO] Building jar: /home/jenkins/agent/workspace/midpoint-master-generic-pg13-jdk17/icf-connectors/dummy-connector-fake/target/dummy-connector-fake-4.8-SNAPSHOT.jar
[INFO] 
[INFO] >>> maven-source-plugin:3.1.0:jar (attach-sources) > generate-sources @ dummy-connector-fake >>>
[INFO] 
[INFO] --- maven-enforcer-plugin:3.1.0:enforce (enforce) @ dummy-connector-fake ---
[INFO] 
[INFO] --- maven-checkstyle-plugin:3.1.2:check (validate) @ dummy-connector-fake ---
[INFO] Starting audit...
Audit done.
[INFO] You have 0 Checkstyle violations.
[INFO] 
[INFO] --- gitdescribe-maven-plugin:3.0:gitdescribe (git-describe) @ dummy-connector-fake ---
[INFO] 
[INFO] <<< maven-source-plugin:3.1.0:jar (attach-sources) < generate-sources @ dummy-connector-fake <<<
[INFO] 
[INFO] 
[INFO] --- maven-source-plugin:3.1.0:jar (attach-sources) @ dummy-connector-fake ---
[INFO] Building jar: /home/jenkins/agent/workspace/midpoint-master-generic-pg13-jdk17/icf-connectors/dummy-connector-fake/target/dummy-connector-fake-4.8-SNAPSHOT-sources.jar
[INFO] 
[INFO] --- maven-dependency-plugin:3.3.0:analyze-only (analyze) @ dummy-connector-fake ---
[INFO] No dependency problems found
[INFO] 
[INFO] --- maven-install-plugin:3.0.1:install (default-install) @ dummy-connector-fake ---
[INFO] Installing /home/jenkins/agent/workspace/midpoint-master-generic-pg13-jdk17/icf-connectors/dummy-connector-fake/pom.xml to /root/.m2/repository/com/evolveum/icf/dummy-connector-fake/4.8-SNAPSHOT/dummy-connector-fake-4.8-SNAPSHOT.pom
[INFO] Installing /home/jenkins/agent/workspace/midpoint-master-generic-pg13-jdk17/icf-connectors/dummy-connector-fake/target/dummy-connector-fake-4.8-SNAPSHOT.jar to /root/.m2/repository/com/evolveum/icf/dummy-connector-fake/4.8-SNAPSHOT/dummy-connector-fake-4.8-SNAPSHOT.jar
[INFO] Installing /home/jenkins/agent/workspace/midpoint-master-generic-pg13-jdk17/icf-connectors/dummy-connector-fake/target/dummy-connector-fake-4.8-SNAPSHOT-sources.jar to /root/.m2/repository/com/evolveum/icf/dummy-connector-fake/4.8-SNAPSHOT/dummy-connector-fake-4.8-SNAPSHOT-sources.jar
[INFO] 
[INFO] -----------< com.evolveum.midpoint.model:authentication-api >-----------
[INFO] Building midPoint Authentication - api 4.8-SNAPSHOT              [41/63]
[INFO] --------------------------------[ jar ]---------------------------------
[WARNING] The POM for org.apache.wicket:wicket-request:jar:10.0.0-M1-SNAPSHOT is missing, no dependency information available
[INFO] ------------------------------------------------------------------------
[INFO] Reactor Summary for midPoint Project 4.8-SNAPSHOT:
[INFO] 
[INFO] midPoint Project ................................... SUCCESS [ 18.305 s]
[INFO] midPoint Infrastructure ............................ SUCCESS [  0.140 s]
[INFO] midPoint Infrastructure - schema ................... SUCCESS [02:17 min]
[INFO] midPoint Repository ................................ SUCCESS [  0.092 s]
[INFO] midPoint Repository - api .......................... SUCCESS [  0.471 s]
[INFO] midPoint Task Manager - api ........................ SUCCESS [  1.099 s]
[INFO] midPoint Infrastructure - testing utils (lvl 2) .... SUCCESS [ 11.660 s]
[INFO] midPoint Infrastructure - common ................... SUCCESS [ 27.375 s]
[INFO] midPoint Audit - api ............................... SUCCESS [  0.388 s]
[INFO] midPoint Security - api ............................ SUCCESS [  0.839 s]
[INFO] midPoint Repository - SQL common support ........... SUCCESS [  1.181 s]
[INFO] midPoint Repository - sql repository ............... SUCCESS [  6.709 s]
[INFO] midPoint System Initialization ..................... SUCCESS [ 20.898 s]
[INFO] midPoint Repository - new SQL repository ........... SUCCESS [  7.591 s]
[INFO] midPoint Repository - sql repository test .......... SUCCESS [07:53 min]
[INFO] midPoint Repository Cache .......................... SUCCESS [ 43.310 s]
[INFO] midPoint Audit - logging impl ...................... SUCCESS [  0.247 s]
[INFO] midPoint Icf Connectors ............................ SUCCESS [  0.069 s]
[INFO] Dummy Resource ..................................... SUCCESS [  0.331 s]
[INFO] midPoint Repository - test utils ................... SUCCESS [  3.629 s]
[INFO] midPoint Security - impl ........................... SUCCESS [  1.635 s]
[INFO] midPoint Task Manager - Quartz impl ................ SUCCESS [01:32 min]
[INFO] midPoint Tools ..................................... SUCCESS [  0.071 s]
[INFO] midPoint Tools - Ninja ............................. SUCCESS [ 54.474 s]
[INFO] midPoint Tools - custom Spring Boot JAR layout ..... SUCCESS [  0.220 s]
[INFO] midPoint Repo Commons .............................. SUCCESS [08:41 min]
[INFO] midPoint Security Enforcer - api ................... SUCCESS [  0.334 s]
[INFO] midPoint Security Enforcer - impl .................. SUCCESS [  0.673 s]
[INFO] midPoint Provisioning .............................. SUCCESS [  0.074 s]
[INFO] midPoint Provisioning - api ........................ SUCCESS [  0.401 s]
[INFO] Unified Connector Framework - api .................. SUCCESS [  0.404 s]
[INFO] Dummy Connector .................................... SUCCESS [  0.538 s]
[INFO] Unified Connector Framework - ConnId impl .......... SUCCESS [01:36 min]
[INFO] Unified Connector Framework - Built-in impl ........ SUCCESS [  1.923 s]
[INFO] midPoint Provisioning - impl ....................... SUCCESS [09:25 min]
[INFO] midPoint Model ..................................... SUCCESS [  0.082 s]
[INFO] midPoint Model - api ............................... SUCCESS [  1.271 s]
[INFO] midPoint Model - common ............................ SUCCESS [ 39.929 s]
[INFO] midPoint Notifications - api ....................... SUCCESS [  0.349 s]
[INFO] Dummy Connector Fake ............................... SUCCESS [  0.133 s]
[INFO] midPoint Authentication - api ...................... FAILURE [  0.067 s]
[INFO] midPoint Model - test .............................. SKIPPED
[INFO] midPoint Report - api .............................. SKIPPED
[INFO] midPoint Cases - api ............................... SKIPPED
[INFO] midPoint Access Certification - api ................ SKIPPED
[INFO] midPoint Model - impl .............................. SKIPPED
[INFO] midPoint Notifications - impl ...................... SKIPPED
[INFO] midPoint Report - impl ............................. SKIPPED
[INFO] midPoint Model - integration tests ................. SKIPPED
[INFO] midPoint Workflow - api ............................ SKIPPED
[INFO] midPoint Cases - impl .............................. SKIPPED
[INFO] midPoint Workflow - impl ........................... SKIPPED
[INFO] midPoint Access Certification - impl ............... SKIPPED
[INFO] midPoint Authentication - impl ..................... SKIPPED
[INFO] midPoint REST-ish service implementation ........... SKIPPED
[INFO] midPoint Customizations ............................ SKIPPED
[INFO] midPoint User Interface ............................ SKIPPED
[INFO] midPoint User Interface - admin web gui ............ SKIPPED
[INFO] midPoint Testing Infrastructure .................... SKIPPED
[INFO] midPoint Testing - Resource Connection Tests ....... SKIPPED
[INFO] midPoint Testing - Long Tests ...................... SKIPPED
[INFO] midPoint Testing - Story Tests ..................... SKIPPED
[INFO] midPoint Testing - REST API ........................ SKIPPED
[INFO] ------------------------------------------------------------------------
[INFO] BUILD FAILURE
[INFO] ------------------------------------------------------------------------
[INFO] Total time:  35:37 min
[INFO] Finished at: 2023-06-30T16:42:56Z
[INFO] ------------------------------------------------------------------------
[ERROR] Failed to execute goal on project authentication-api: Could not resolve dependencies for project com.evolveum.midpoint.model:authentication-api:jar:4.8-SNAPSHOT: Could not find artifact org.apache.wicket:wicket-request:jar:10.0.0-M1-SNAPSHOT in evolveum-snapshots (https://nexus.evolveum.com/nexus/content/repositories/snapshots/) -> [Help 1]
[ERROR] 
[ERROR] To see the full stack trace of the errors, re-run Maven with the -e switch.
[ERROR] Re-run Maven using the -X switch to enable full debug logging.
[ERROR] 
[ERROR] For more information about the errors and possible solutions, please read the following articles:
[ERROR] [Help 1] http://cwiki.apache.org/confluence/display/MAVEN/DependencyResolutionException
[ERROR] 
[ERROR] After correcting the problems, you can resume the build with the command
[ERROR]   mvn <args> -rf :authentication-api
[Pipeline] }
[Pipeline] // container
[Pipeline] }
[Pipeline] // stage
[Pipeline] error
[Pipeline] step


More information about the midPoint-ci mailing list