[midPoint-ci] Build failed in Jenkins: midPoint - master - compile #830

Jenkins noreply at evolveum.com
Tue Feb 21 16:28:05 CET 2023


See <https://jenkins.evolveum.com/job/midpoint-master-compile/830/display/redirect>

Changes:


------------------------------------------
[...truncated 2804 lines...]
[INFO] 
[INFO] --- maven-compiler-plugin:3.10.1:compile (default-compile) @ cases-api ---
[INFO] Changes detected - recompiling the module!
[INFO] Compiling 25 source files to /home/jenkins/agent/workspace/midpoint-master-compile/model/cases-api/target/classes
[INFO] 
[INFO] --- maven-resources-plugin:3.1.0:testResources (default-testResources) @ cases-api ---
[INFO] Not copying test resources
[INFO] 
[INFO] --- maven-compiler-plugin:3.10.1:testCompile (default-testCompile) @ cases-api ---
[INFO] Not compiling test sources
[INFO] 
[INFO] --- maven-surefire-plugin:3.0.0-M6:test (default-test) @ cases-api ---
[INFO] Tests are skipped.
[INFO] 
[INFO] --- maven-jar-plugin:3.2.2:jar (default-jar) @ cases-api ---
[INFO] Building jar: /home/jenkins/agent/workspace/midpoint-master-compile/model/cases-api/target/cases-api-4.7-SNAPSHOT.jar
[INFO] 
[INFO] >>> maven-source-plugin:3.1.0:jar (attach-sources) > generate-sources @ cases-api >>>
[INFO] 
[INFO] --- maven-enforcer-plugin:3.0.0:enforce (enforce) @ cases-api ---
[INFO] 
[INFO] --- maven-checkstyle-plugin:3.1.2:check (validate) @ cases-api ---
[INFO] Starting audit...
Audit done.
[INFO] You have 0 Checkstyle violations.
[INFO] 
[INFO] --- gitdescribe-maven-plugin:3.0:gitdescribe (git-describe) @ cases-api ---
[INFO] 
[INFO] <<< maven-source-plugin:3.1.0:jar (attach-sources) < generate-sources @ cases-api <<<
[INFO] 
[INFO] 
[INFO] --- maven-source-plugin:3.1.0:jar (attach-sources) @ cases-api ---
[INFO] Building jar: /home/jenkins/agent/workspace/midpoint-master-compile/model/cases-api/target/cases-api-4.7-SNAPSHOT-sources.jar
[INFO] 
[INFO] -----------< com.evolveum.midpoint.model:certification-api >------------
[INFO] Building midPoint Access Certification - api 4.7-SNAPSHOT        [46/64]
[INFO] --------------------------------[ jar ]---------------------------------
[INFO] 
[INFO] --- maven-clean-plugin:3.2.0:clean (default-clean) @ certification-api ---
[INFO] 
[INFO] --- maven-enforcer-plugin:3.0.0:enforce (enforce) @ certification-api ---
[INFO] 
[INFO] --- maven-checkstyle-plugin:3.1.2:check (validate) @ certification-api ---
[INFO] Starting audit...
Audit done.
[INFO] You have 0 Checkstyle violations.
[INFO] 
[INFO] --- gitdescribe-maven-plugin:3.0:gitdescribe (git-describe) @ certification-api ---
[INFO] Setting Git Describe: v4.7devel-757-g0d55388503
[INFO] 
[INFO] --- maven-resources-plugin:3.1.0:resources (default-resources) @ certification-api ---
[INFO] Using 'UTF-8' encoding to copy filtered resources.
[INFO] skip non existing resourceDirectory /home/jenkins/agent/workspace/midpoint-master-compile/model/certification-api/src/main/resources
[INFO] 
[INFO] --- maven-compiler-plugin:3.10.1:compile (default-compile) @ certification-api ---
[INFO] Changes detected - recompiling the module!
[INFO] Compiling 4 source files to /home/jenkins/agent/workspace/midpoint-master-compile/model/certification-api/target/classes
[INFO] 
[INFO] --- maven-resources-plugin:3.1.0:testResources (default-testResources) @ certification-api ---
[INFO] Not copying test resources
[INFO] 
[INFO] --- maven-compiler-plugin:3.10.1:testCompile (default-testCompile) @ certification-api ---
[INFO] Not compiling test sources
[INFO] 
[INFO] --- maven-surefire-plugin:3.0.0-M6:test (default-test) @ certification-api ---
[INFO] Tests are skipped.
[INFO] 
[INFO] --- maven-jar-plugin:3.2.2:jar (default-jar) @ certification-api ---
[INFO] Building jar: /home/jenkins/agent/workspace/midpoint-master-compile/model/certification-api/target/certification-api-4.7-SNAPSHOT.jar
[INFO] 
[INFO] >>> maven-source-plugin:3.1.0:jar (attach-sources) > generate-sources @ certification-api >>>
[INFO] 
[INFO] --- maven-enforcer-plugin:3.0.0:enforce (enforce) @ certification-api ---
[INFO] 
[INFO] --- maven-checkstyle-plugin:3.1.2:check (validate) @ certification-api ---
[INFO] Starting audit...
Audit done.
[INFO] You have 0 Checkstyle violations.
[INFO] 
[INFO] --- gitdescribe-maven-plugin:3.0:gitdescribe (git-describe) @ certification-api ---
[INFO] 
[INFO] <<< maven-source-plugin:3.1.0:jar (attach-sources) < generate-sources @ certification-api <<<
[INFO] 
[INFO] 
[INFO] --- maven-source-plugin:3.1.0:jar (attach-sources) @ certification-api ---
[INFO] Building jar: /home/jenkins/agent/workspace/midpoint-master-compile/model/certification-api/target/certification-api-4.7-SNAPSHOT-sources.jar
[INFO] 
[INFO] ---------------< com.evolveum.midpoint.model:model-impl >---------------
[INFO] Building midPoint Model - impl 4.7-SNAPSHOT                      [47/64]
[INFO] --------------------------------[ jar ]---------------------------------
[INFO] 
[INFO] --- maven-clean-plugin:3.2.0:clean (default-clean) @ model-impl ---
[INFO] 
[INFO] --- maven-enforcer-plugin:3.0.0:enforce (enforce) @ model-impl ---
[INFO] 
[INFO] --- maven-checkstyle-plugin:3.1.2:check (validate) @ model-impl ---
[INFO] Starting audit...
Audit done.
[INFO] You have 0 Checkstyle violations.
[INFO] 
[INFO] --- gitdescribe-maven-plugin:3.0:gitdescribe (git-describe) @ model-impl ---
[INFO] Setting Git Describe: v4.7devel-757-g0d55388503
[INFO] 
[INFO] --- maven-resources-plugin:3.1.0:resources (default-resources) @ model-impl ---
[INFO] Using 'UTF-8' encoding to copy filtered resources.
[INFO] Copying 3 resources
[INFO] 
[INFO] --- maven-compiler-plugin:3.10.1:compile (default-compile) @ model-impl ---
[INFO] Changes detected - recompiling the module!
[INFO] Compiling 537 source files to /home/jenkins/agent/workspace/midpoint-master-compile/model/model-impl/target/classes
[INFO] /home/jenkins/agent/workspace/midpoint-master-compile/model/model-impl/src/main/java/com/evolveum/midpoint/model/impl/controller/ModelController.java: Some input files use or override a deprecated API.
[INFO] /home/jenkins/agent/workspace/midpoint-master-compile/model/model-impl/src/main/java/com/evolveum/midpoint/model/impl/controller/ModelController.java: Recompile with -Xlint:deprecation for details.
[INFO] /home/jenkins/agent/workspace/midpoint-master-compile/model/model-impl/src/main/java/com/evolveum/midpoint/model/impl/lens/LensElementContext.java: Some input files use unchecked or unsafe operations.
[INFO] /home/jenkins/agent/workspace/midpoint-master-compile/model/model-impl/src/main/java/com/evolveum/midpoint/model/impl/lens/LensElementContext.java: Recompile with -Xlint:unchecked for details.
[INFO] -------------------------------------------------------------
[ERROR] COMPILATION ERROR : 
[INFO] -------------------------------------------------------------
[ERROR] /home/jenkins/agent/workspace/midpoint-master-compile/model/model-impl/src/main/java/com/evolveum/midpoint/model/impl/visualizer/ShadowDescriptionHandler.java:[73,25] no suitable constructor found for SingleLocalizableMessage(java.lang.String)
    constructor com.evolveum.midpoint.util.SingleLocalizableMessage.SingleLocalizableMessage(java.lang.String,java.lang.Object[],com.evolveum.midpoint.util.LocalizableMessage) is not applicable
      (actual and formal argument lists differ in length)
    constructor com.evolveum.midpoint.util.SingleLocalizableMessage.SingleLocalizableMessage(java.lang.String,java.lang.Object[],java.lang.String) is not applicable
      (actual and formal argument lists differ in length)
[ERROR] /home/jenkins/agent/workspace/midpoint-master-compile/model/model-impl/src/main/java/com/evolveum/midpoint/model/impl/visualizer/ShadowDescriptionHandler.java:[76,25] no suitable constructor found for SingleLocalizableMessage(java.lang.String)
    constructor com.evolveum.midpoint.util.SingleLocalizableMessage.SingleLocalizableMessage(java.lang.String,java.lang.Object[],com.evolveum.midpoint.util.LocalizableMessage) is not applicable
      (actual and formal argument lists differ in length)
    constructor com.evolveum.midpoint.util.SingleLocalizableMessage.SingleLocalizableMessage(java.lang.String,java.lang.Object[],java.lang.String) is not applicable
      (actual and formal argument lists differ in length)
[ERROR] /home/jenkins/agent/workspace/midpoint-master-compile/model/model-impl/src/main/java/com/evolveum/midpoint/model/impl/visualizer/ShadowDescriptionHandler.java:[72,17] no suitable constructor found for SingleLocalizableMessage(java.lang.String,java.lang.Object[])
    constructor com.evolveum.midpoint.util.SingleLocalizableMessage.SingleLocalizableMessage(java.lang.String,java.lang.Object[],com.evolveum.midpoint.util.LocalizableMessage) is not applicable
      (actual and formal argument lists differ in length)
    constructor com.evolveum.midpoint.util.SingleLocalizableMessage.SingleLocalizableMessage(java.lang.String,java.lang.Object[],java.lang.String) is not applicable
      (actual and formal argument lists differ in length)
[ERROR] /home/jenkins/agent/workspace/midpoint-master-compile/model/model-impl/src/main/java/com/evolveum/midpoint/model/impl/visualizer/AssignmentDescriptionHandler.java:[60,25] no suitable constructor found for SingleLocalizableMessage(java.lang.String)
    constructor com.evolveum.midpoint.util.SingleLocalizableMessage.SingleLocalizableMessage(java.lang.String,java.lang.Object[],com.evolveum.midpoint.util.LocalizableMessage) is not applicable
      (actual and formal argument lists differ in length)
    constructor com.evolveum.midpoint.util.SingleLocalizableMessage.SingleLocalizableMessage(java.lang.String,java.lang.Object[],java.lang.String) is not applicable
      (actual and formal argument lists differ in length)
[INFO] 4 errors 
[INFO] -------------------------------------------------------------
[INFO] ------------------------------------------------------------------------
[INFO] Reactor Summary for midPoint Project 4.7-SNAPSHOT:
[INFO] 
[INFO] midPoint Project ................................... SUCCESS [ 36.053 s]
[INFO] midPoint Infrastructure ............................ SUCCESS [  0.289 s]
[INFO] midPoint Infrastructure - schema ................... SUCCESS [02:01 min]
[INFO] midPoint Repository ................................ SUCCESS [  0.294 s]
[INFO] midPoint Repository - api .......................... SUCCESS [  0.554 s]
[INFO] midPoint Task Manager - api ........................ SUCCESS [  2.673 s]
[INFO] midPoint Infrastructure - testing utils (lvl 2) .... SUCCESS [  9.712 s]
[INFO] midPoint Infrastructure - common ................... SUCCESS [  1.900 s]
[INFO] midPoint Audit - api ............................... SUCCESS [  0.562 s]
[INFO] midPoint Security - api ............................ SUCCESS [  1.087 s]
[INFO] midPoint Repository - SQL common support ........... SUCCESS [  1.993 s]
[INFO] midPoint Repository - sql repository ............... SUCCESS [  9.274 s]
[INFO] midPoint System Initialization ..................... SUCCESS [ 23.936 s]
[INFO] midPoint Repository - new SQL repository ........... SUCCESS [ 26.508 s]
[INFO] midPoint Repository - sql repository test .......... SUCCESS [  6.174 s]
[INFO] midPoint Repository Cache .......................... SUCCESS [  1.728 s]
[INFO] midPoint Audit - logging impl ...................... SUCCESS [  0.382 s]
[INFO] midPoint Tools ..................................... SUCCESS [  0.124 s]
[INFO] midPoint Tools - Ninja ............................. SUCCESS [  5.654 s]
[INFO] midPoint Tools - custom Spring Boot JAR layout ..... SUCCESS [  0.653 s]
[INFO] midPoint Infrastructure - pure JAXB schema ......... SUCCESS [ 21.242 s]
[INFO] midPoint Icf Connectors ............................ SUCCESS [  0.262 s]
[INFO] Dummy Resource ..................................... SUCCESS [  0.671 s]
[INFO] midPoint Repository - test utils ................... SUCCESS [  4.292 s]
[INFO] midPoint Security - impl ........................... SUCCESS [  1.221 s]
[INFO] midPoint Task Manager - Quartz impl ................ SUCCESS [  2.963 s]
[INFO] midPoint Repo Commons .............................. SUCCESS [  5.501 s]
[INFO] midPoint Security Enforcer - api ................... SUCCESS [  0.440 s]
[INFO] midPoint Security Enforcer - impl .................. SUCCESS [  1.268 s]
[INFO] midPoint Provisioning .............................. SUCCESS [  0.434 s]
[INFO] midPoint Provisioning - api ........................ SUCCESS [  0.752 s]
[INFO] Unified Connector Framework - api .................. SUCCESS [  0.632 s]
[INFO] Dummy Connector .................................... SUCCESS [  1.150 s]
[INFO] Unified Connector Framework - ConnId impl .......... SUCCESS [  5.016 s]
[INFO] Unified Connector Framework - Built-in impl ........ SUCCESS [  2.940 s]
[INFO] midPoint Provisioning - impl ....................... SUCCESS [  7.192 s]
[INFO] midPoint Model ..................................... SUCCESS [  0.317 s]
[INFO] midPoint Model - api ............................... SUCCESS [  1.421 s]
[INFO] midPoint Model - common ............................ SUCCESS [  9.632 s]
[INFO] midPoint Notifications - api ....................... SUCCESS [  0.841 s]
[INFO] Dummy Connector Fake ............................... SUCCESS [  0.519 s]
[INFO] midPoint Authentication - api ...................... SUCCESS [  1.127 s]
[INFO] midPoint Model - test .............................. SUCCESS [  2.433 s]
[INFO] midPoint Report - api .............................. SUCCESS [  0.445 s]
[INFO] midPoint Cases - api ............................... SUCCESS [  0.886 s]
[INFO] midPoint Access Certification - api ................ SUCCESS [  0.679 s]
[INFO] midPoint Model - impl .............................. FAILURE [ 13.876 s]
[INFO] midPoint Notifications - impl ...................... SKIPPED
[INFO] midPoint Report - impl ............................. SKIPPED
[INFO] midPoint Model - integration tests ................. SKIPPED
[INFO] midPoint Workflow - api ............................ SKIPPED
[INFO] midPoint Cases - impl .............................. SKIPPED
[INFO] midPoint Workflow - impl ........................... SKIPPED
[INFO] midPoint Access Certification - impl ............... SKIPPED
[INFO] midPoint Authentication - impl ..................... SKIPPED
[INFO] midPoint REST-ish service implementation ........... SKIPPED
[INFO] midPoint Customizations ............................ SKIPPED
[INFO] midPoint User Interface ............................ SKIPPED
[INFO] midPoint User Interface - admin web gui ............ SKIPPED
[INFO] midPoint Testing Infrastructure .................... SKIPPED
[INFO] midPoint Testing - Resource Connection Tests ....... SKIPPED
[INFO] midPoint Testing - Long Tests ...................... SKIPPED
[INFO] midPoint Testing - Story Tests ..................... SKIPPED
[INFO] midPoint Testing - REST API ........................ SKIPPED
[INFO] ------------------------------------------------------------------------
[INFO] BUILD FAILURE
[INFO] ------------------------------------------------------------------------
[INFO] Total time:  05:44 min
[INFO] Finished at: 2023-02-21T15:28:04Z
[INFO] ------------------------------------------------------------------------
[ERROR] Failed to execute goal org.apache.maven.plugins:maven-compiler-plugin:3.10.1:compile (default-compile) on project model-impl: Compilation failure: Compilation failure: 
[ERROR] /home/jenkins/agent/workspace/midpoint-master-compile/model/model-impl/src/main/java/com/evolveum/midpoint/model/impl/visualizer/ShadowDescriptionHandler.java:[73,25] no suitable constructor found for SingleLocalizableMessage(java.lang.String)
[ERROR]     constructor com.evolveum.midpoint.util.SingleLocalizableMessage.SingleLocalizableMessage(java.lang.String,java.lang.Object[],com.evolveum.midpoint.util.LocalizableMessage) is not applicable
[ERROR]       (actual and formal argument lists differ in length)
[ERROR]     constructor com.evolveum.midpoint.util.SingleLocalizableMessage.SingleLocalizableMessage(java.lang.String,java.lang.Object[],java.lang.String) is not applicable
[ERROR]       (actual and formal argument lists differ in length)
[ERROR] /home/jenkins/agent/workspace/midpoint-master-compile/model/model-impl/src/main/java/com/evolveum/midpoint/model/impl/visualizer/ShadowDescriptionHandler.java:[76,25] no suitable constructor found for SingleLocalizableMessage(java.lang.String)
[ERROR]     constructor com.evolveum.midpoint.util.SingleLocalizableMessage.SingleLocalizableMessage(java.lang.String,java.lang.Object[],com.evolveum.midpoint.util.LocalizableMessage) is not applicable
[ERROR]       (actual and formal argument lists differ in length)
[ERROR]     constructor com.evolveum.midpoint.util.SingleLocalizableMessage.SingleLocalizableMessage(java.lang.String,java.lang.Object[],java.lang.String) is not applicable
[ERROR]       (actual and formal argument lists differ in length)
[ERROR] /home/jenkins/agent/workspace/midpoint-master-compile/model/model-impl/src/main/java/com/evolveum/midpoint/model/impl/visualizer/ShadowDescriptionHandler.java:[72,17] no suitable constructor found for SingleLocalizableMessage(java.lang.String,java.lang.Object[])
[ERROR]     constructor com.evolveum.midpoint.util.SingleLocalizableMessage.SingleLocalizableMessage(java.lang.String,java.lang.Object[],com.evolveum.midpoint.util.LocalizableMessage) is not applicable
[ERROR]       (actual and formal argument lists differ in length)
[ERROR]     constructor com.evolveum.midpoint.util.SingleLocalizableMessage.SingleLocalizableMessage(java.lang.String,java.lang.Object[],java.lang.String) is not applicable
[ERROR]       (actual and formal argument lists differ in length)
[ERROR] /home/jenkins/agent/workspace/midpoint-master-compile/model/model-impl/src/main/java/com/evolveum/midpoint/model/impl/visualizer/AssignmentDescriptionHandler.java:[60,25] no suitable constructor found for SingleLocalizableMessage(java.lang.String)
[ERROR]     constructor com.evolveum.midpoint.util.SingleLocalizableMessage.SingleLocalizableMessage(java.lang.String,java.lang.Object[],com.evolveum.midpoint.util.LocalizableMessage) is not applicable
[ERROR]       (actual and formal argument lists differ in length)
[ERROR]     constructor com.evolveum.midpoint.util.SingleLocalizableMessage.SingleLocalizableMessage(java.lang.String,java.lang.Object[],java.lang.String) is not applicable
[ERROR]       (actual and formal argument lists differ in length)
[ERROR] -> [Help 1]
[ERROR] 
[ERROR] To see the full stack trace of the errors, re-run Maven with the -e switch.
[ERROR] Re-run Maven using the -X switch to enable full debug logging.
[ERROR] 
[ERROR] For more information about the errors and possible solutions, please read the following articles:
[ERROR] [Help 1] http://cwiki.apache.org/confluence/display/MAVEN/MojoFailureException
[ERROR] 
[ERROR] After correcting the problems, you can resume the build with the command
[ERROR]   mvn <args> -rf :model-impl
[Pipeline] }
[Pipeline] // container
[Pipeline] }
[Pipeline] // stage
[Pipeline] error
[Pipeline] step


More information about the midPoint-ci mailing list